BDBM50074641 CHEMBL269727::R-K-K-Y-K-E-R-R-K-NH2
SMILES: NCCCC[C@H](NC(=O)[C@H](CCCNC(N)=N)NC(=O)[C@H](CCCNC(N)=N)NC(=O)[C@H](CCC(O)=O)NC(=O)[C@H](CCCCN)NC(=O)[C@H](Cc1ccc(O)cc1)NC(=O)[C@H](CCCCN)NC(=O)[C@H](CCCCN)NC(=O)[C@@H](N)CCCNC(N)=N)C(N)=O
InChI Key: InChIKey=ZXTQHXWZPZAIEV-GMIRWQTLSA-N
Data: 1 IC50
Activity Spreadsheet -- Enzyme Inhibition Constant Data from BindingDB
Found 1 hit for monomerid = 50074641
Trg + Lig
Ki
nM
ΔG°
kcal/mole
IC50
nM
Kd
nM
EC50/IC50
nM
koff
s-1
kon
M-1s-1
pHTemp
°C
Myosin light chain kinase, smooth muscle
(Gallus gallus (chicken))
BDBM50074641
(CHEMBL269727 | R-K-K-Y-K-E-R-R-K-NH2)
Show SMILES NCCCC[C@H](NC(=O)[C@H](CCCNC(N)=N)NC(=O)[C@H](CCCNC(N)=N)NC(=O)[C@H](CCC(O)=O)NC(=O)[C@H](CCCCN)NC(=O)[C@H](Cc1ccc(O)cc1)NC(=O)[C@H](CCCCN)NC(=O)[C@H](CCCCN)NC(=O)[C@@H](N)CCCNC(N)=N)C(N)=O
Show InChI InChI=1S/C56H103N23O12/c57-25-5-1-13-36(45(62)83)72-47(85)40(17-10-30-70-55(65)66)75-50(88)41(18-11-31-71-56(67)68)76-52(90)42(23-24-44(81)82)78-49(87)38(15-3-7-27-59)77-53(91)43(32-33-19-21-34(80)22-20-33)79-51(89)39(16-4-8-28-60)74-48(86)37(14-2-6-26-58)73-46(84)35(61)12-9-29-69-54(63)64/h19-22,35-43,80H,1-18,23-32,57-61H2,(H2,62,83)(H,72,85)(H,73,84)(H,74,86)(H,75,88)(H,76,90)(H,77,91)(H,78,87)(H,79,89)(H,81,82)(H4,63,64,69)(H4,65,66,70)(H4,67,68,71)/t35-,36-,37-,38-,39-,40-,41-,42-,43-/m0/s1
Reactome pathway
n/an/a 870n/an/an/an/an/an/a
Northwestern University
Curated by ChEMBL
Assay Description
Inhibitory activity against MLCK (smooth muscle myosin light chain kinase)
J Med Chem 42: 910-9 (1999)
Article DOI: 10.1021/jm980573a
BindingDB Entry DOI: 10.7270/Q2JS9R4T