BDBM50074890 4'-(2,3-Bis-hydroxymethyl-6,7-dimethoxy-naphthalen-1-yl)-[1,2']bipyridinyl-2-one::CHEMBL12599
SMILES: COc1cc2cc(CO)c(CO)c(-c3ccnc(c3)-n3ccccc3=O)c2cc1OC
InChI Key: InChIKey=SJQXOZSDYOZKJF-UHFFFAOYSA-N
Data: 4 IC50
Activity Spreadsheet -- Enzyme Inhibition Constant Data from BindingDB
Found 4 hits for monomerid = 50074890
Trg + Lig
Ki
nM
ΔG°
kcal/mole
IC50
nM
Kd
nM
EC50/IC50
nM
koff
s-1
kon
M-1s-1
pHTemp
°C
Phosphodiesterase 4
(Homo sapiens (Human))
BDBM50074890
(4'-(2,3-Bis-hydroxymethyl-6,7-dimethoxy-naphthalen...)
Show SMILES COc1cc2cc(CO)c(CO)c(-c3ccnc(c3)-n3ccccc3=O)c2cc1OC
Show InChI InChI=1S/C24H22N2O5/c1-30-20-10-16-9-17(13-27)19(14-28)24(18(16)12-21(20)31-2)15-6-7-25-22(11-15)26-8-4-3-5-23(26)29/h3-12,27-28H,13-14H2,1-2H3
n/an/a 80n/an/an/an/an/an/a
Tanabe Seiyaku Company, Ltd.
Curated by ChEMBL
Assay Description
In vitro inhibition of Phosphodiesterase 4 from guinea pig lung
J Med Chem 42: 1088-99 (1999)
Article DOI: 10.1021/jm980314l
BindingDB Entry DOI: 10.7270/Q25M66DH
cGMP-specific 3',5'-cyclic phosphodiesterase
(Homo sapiens (Human))
BDBM50074890
(4'-(2,3-Bis-hydroxymethyl-6,7-dimethoxy-naphthalen...)
Show SMILES COc1cc2cc(CO)c(CO)c(-c3ccnc(c3)-n3ccccc3=O)c2cc1OC
Show InChI InChI=1S/C24H22N2O5/c1-30-20-10-16-9-17(13-27)19(14-28)24(18(16)12-21(20)31-2)15-6-7-25-22(11-15)26-8-4-3-5-23(26)29/h3-12,27-28H,13-14H2,1-2H3
Reactome pathway
n/an/a 4.00E+4n/an/an/an/an/an/a
Tanabe Seiyaku Company, Ltd.
Curated by ChEMBL
Assay Description
Inhibition of Phosphodiesterase 5 of guinea pig lung
J Med Chem 42: 1088-99 (1999)
Article DOI: 10.1021/jm980314l
BindingDB Entry DOI: 10.7270/Q25M66DH
Phosphodiesterase 3
(Homo sapiens (Human))
BDBM50074890
(4'-(2,3-Bis-hydroxymethyl-6,7-dimethoxy-naphthalen...)
Show SMILES COc1cc2cc(CO)c(CO)c(-c3ccnc(c3)-n3ccccc3=O)c2cc1OC
Show InChI InChI=1S/C24H22N2O5/c1-30-20-10-16-9-17(13-27)19(14-28)24(18(16)12-21(20)31-2)15-6-7-25-22(11-15)26-8-4-3-5-23(26)29/h3-12,27-28H,13-14H2,1-2H3
n/an/a 2.00E+3n/an/an/an/an/an/a
Tanabe Seiyaku Company, Ltd.
Curated by ChEMBL
Assay Description
In vitro inhibition of Phosphodiesterase 3 activity from guinea pig cardiac ventricle
J Med Chem 42: 1088-99 (1999)
Article DOI: 10.1021/jm980314l
BindingDB Entry DOI: 10.7270/Q25M66DH
Phosphodiesterase 1
(Homo sapiens (Human))
BDBM50074890
(4'-(2,3-Bis-hydroxymethyl-6,7-dimethoxy-naphthalen...)
Show SMILES COc1cc2cc(CO)c(CO)c(-c3ccnc(c3)-n3ccccc3=O)c2cc1OC
Show InChI InChI=1S/C24H22N2O5/c1-30-20-10-16-9-17(13-27)19(14-28)24(18(16)12-21(20)31-2)15-6-7-25-22(11-15)26-8-4-3-5-23(26)29/h3-12,27-28H,13-14H2,1-2H3
n/an/a 5.00E+4n/an/an/an/an/an/a
Tanabe Seiyaku Company, Ltd.
Curated by ChEMBL
Assay Description
Inhibition of Phosphodiesterase 1 of guinea pig cardiac ventricle
J Med Chem 42: 1088-99 (1999)
Article DOI: 10.1021/jm980314l
BindingDB Entry DOI: 10.7270/Q25M66DH