BDBM50075075 CHEMBL3414628
SMILES: NCCCN(CC[C@H](N)C(O)=O)C[C@H]1O[C@H]([C@H](O)[C@@H]1O)n1cnc2c(N)ncnc12
InChI Key: InChIKey=NHAKJKNYYCYZBR-UOYPZJKHSA-N
Data: 1 IC50
PDB links: 3 PDB IDs match this monomer.
Activity Spreadsheet -- Enzyme Inhibition Constant Data from BindingDB
Found 1 hit for monomerid = 50075075
Trg + Lig
Ki
nM
ΔG°
kcal/mole
IC50
nM
Kd
nM
EC50/IC50
nM
koff
s-1
kon
M-1s-1
pHTemp
°C
Protein-arginine N-methyltransferase 1
(Homo sapiens (Human))
BDBM50075075
(CHEMBL3414628)
Show SMILES NCCCN(CC[C@H](N)C(O)=O)C[C@H]1O[C@H]([C@H](O)[C@@H]1O)n1cnc2c(N)ncnc12 |r|
Show InChI InChI=1S/C17H28N8O5/c18-3-1-4-24(5-2-9(19)17(28)29)6-10-12(26)13(27)16(30-10)25-8-23-11-14(20)21-7-22-15(11)25/h7-10,12-13,16,26-27H,1-6,18-19H2,(H,28,29)(H2,20,21,22)/t9-,10+,12+,13+,16+/m0/s1
n/an/a 3.90E+3n/an/an/an/an/an/a
Icahn School of Medicine at Mount Sinai
Curated by ChEMBL
Assay Description
Inhibition of recombinant GST-tagged PRMT1 (unknown origin) using GST-P3 as substrate after 90 mins by scintillation counting analysis in presence of...
J Med Chem 58: 1596-629 (2015)
Article DOI: 10.1021/jm501234a
BindingDB Entry DOI: 10.7270/Q28K7BS2