BDBM50075103 CHEBI:48202::NANAFROCIN::Nanafrocin
SMILES: C[C@@H]1O[C@@H](CC(O)=O)CC2=C1C(=O)c1c(O)cccc1C2=O
InChI Key: InChIKey=ZCJHPTKRISJQTN-JGVFFNPUSA-N
Data: 4 IC50
Activity Spreadsheet -- Enzyme Inhibition Constant Data from BindingDB
Found 4 hits for monomerid = 50075103
Trg + Lig
Ki
nM
ΔG°
kcal/mole
IC50
nM
Kd
nM
EC50/IC50
nM
koff
s-1
kon
M-1s-1
pHTemp
°C
DNA (cytosine-5)-methyltransferase 3B
(Homo sapiens (Human))
BDBM50075103
(CHEBI:48202 | NANAFROCIN | Nanafrocin)
Show SMILES C[C@@H]1O[C@@H](CC(O)=O)CC2=C1C(=O)c1c(O)cccc1C2=O |c:9|
Show InChI InChI=1S/C16H14O6/c1-7-13-10(5-8(22-7)6-12(18)19)15(20)9-3-2-4-11(17)14(9)16(13)21/h2-4,7-8,17H,5-6H2,1H3,(H,18,19)/t7-,8+/m0/s1
Reactome pathway
n/an/a 500n/an/an/an/an/an/a
CNRS-Pierre Fabre
Curated by ChEMBL
Assay Description
Inhibition of His6-tagged human recombinant DNMT3b expressed in insect Sf9 cells assessed as reduction in DNA methyltransferase activity using 5'-bio...
J Med Chem 58: 2569-83 (2015)
Article DOI: 10.1021/jm500843d
BindingDB Entry DOI: 10.7270/Q24T6M36
DNA (cytosine-5)-methyltransferase 3B
(Homo sapiens (Human))
BDBM50075103
(CHEBI:48202 | NANAFROCIN | Nanafrocin)
Show SMILES C[C@@H]1O[C@@H](CC(O)=O)CC2=C1C(=O)c1c(O)cccc1C2=O |c:9|
Show InChI InChI=1S/C16H14O6/c1-7-13-10(5-8(22-7)6-12(18)19)15(20)9-3-2-4-11(17)14(9)16(13)21/h2-4,7-8,17H,5-6H2,1H3,(H,18,19)/t7-,8+/m0/s1
Reactome pathway
n/an/a 730n/an/an/an/an/an/a
Yale University
Curated by ChEMBL
Assay Description
Inhibition of human recombinant DNMT3B expressed in baculovirus infected insect cells by DRONE assay
ACS Med Chem Lett 11: 971-976 (2020)
DNA (cytosine-5)-methyltransferase 3B
(Homo sapiens (Human))
BDBM50075103
(CHEBI:48202 | NANAFROCIN | Nanafrocin)
Show SMILES C[C@@H]1O[C@@H](CC(O)=O)CC2=C1C(=O)c1c(O)cccc1C2=O |c:9|
Show InChI InChI=1S/C16H14O6/c1-7-13-10(5-8(22-7)6-12(18)19)15(20)9-3-2-4-11(17)14(9)16(13)21/h2-4,7-8,17H,5-6H2,1H3,(H,18,19)/t7-,8+/m0/s1
Reactome pathway
n/an/a 1.50E+3n/an/an/an/an/an/a
Yale University
Curated by ChEMBL
Assay Description
Inhibition of human recombinant DNMT3B expressed in baculovirus infected insect cells using CpG site containing internally quenched hairpin oligonucl...
ACS Med Chem Lett 11: 971-976 (2020)
DNA (cytosine-5)-methyltransferase 3B
(Homo sapiens (Human))
BDBM50075103
(CHEBI:48202 | NANAFROCIN | Nanafrocin)
Show SMILES C[C@@H]1O[C@@H](CC(O)=O)CC2=C1C(=O)c1c(O)cccc1C2=O |c:9|
Show InChI InChI=1S/C16H14O6/c1-7-13-10(5-8(22-7)6-12(18)19)15(20)9-3-2-4-11(17)14(9)16(13)21/h2-4,7-8,17H,5-6H2,1H3,(H,18,19)/t7-,8+/m0/s1
Reactome pathway
n/an/a 500n/an/an/an/an/an/a
Yale University
Curated by ChEMBL
Assay Description
Inhibition of human DNMT3B using [3H]-SAM
ACS Med Chem Lett 11: 971-976 (2020)