BDBM50075134 4-(4-Chloro-2-methyl-phenoxy)-1-[(S)-3-(pyrrolidine-1-carbonyl)-3,4-dihydro-1H-isoquinolin-2-yl]-butan-1-one::CHEMBL342718
SMILES: Cc1cc(Cl)ccc1OCCCC(=O)N1Cc2ccccc2C[C@H]1C(=O)N1CCCC1
InChI Key: InChIKey=RWSDJJXSOOFDEQ-QFIPXVFZSA-N
Data: 1 IC50
Activity Spreadsheet -- Enzyme Inhibition Constant Data from BindingDB
Found 1 hit for monomerid = 50075134
Trg + Lig
Ki
nM
ΔG°
kcal/mole
IC50
nM
Kd
nM
EC50/IC50
nM
koff
s-1
kon
M-1s-1
pHTemp
°C
Prolyl endopeptidase
(Homo sapiens (Human))
BDBM50075134
(4-(4-Chloro-2-methyl-phenoxy)-1-[(S)-3-(pyrrolidin...)
Show SMILES Cc1cc(Cl)ccc1OCCCC(=O)N1Cc2ccccc2C[C@H]1C(=O)N1CCCC1
Show InChI InChI=1S/C25H29ClN2O3/c1-18-15-21(26)10-11-23(18)31-14-6-9-24(29)28-17-20-8-3-2-7-19(20)16-22(28)25(30)27-12-4-5-13-27/h2-3,7-8,10-11,15,22H,4-6,9,12-14,16-17H2,1H3/t22-/m0/s1
n/an/a 17n/an/an/an/an/an/a
Université de Lille II
Curated by ChEMBL
Assay Description
Inhibition of Prolyl endopeptidase
Bioorg Med Chem Lett 9: 437-42 (1999)
BindingDB Entry DOI: 10.7270/Q2348JJR