BDBM50075141 (E)-N-[(S)-1-(5-Methyl-4-oxo-4H-thieno[2,3-d][1,3]oxazin-2-yl)-ethyl]-3-(2-nitro-phenyl)-acrylamide::CHEMBL141580
SMILES: C[C@H](NC(=O)\C=C\c1ccccc1[N+]([O-])=O)c1nc2scc(C)c2c(=O)o1
InChI Key: InChIKey=VUKOZTXHKZMXKO-AEZGRPFRSA-N
Data: 3 IC50
Activity Spreadsheet -- Enzyme Inhibition Constant Data from BindingDB
Found 3 hits for monomerid = 50075141
Trg + Lig
Ki
nM
ΔG°
kcal/mole
IC50
nM
Kd
nM
EC50/IC50
nM
koff
s-1
kon
M-1s-1
pHTemp
°C
Human herpesvirus 6 protease
(Human herpesvirus 6A (strain Uganda-1102) (HHV-6 v...)
BDBM50075141
((E)-N-[(S)-1-(5-Methyl-4-oxo-4H-thieno[2,3-d][1,3]...)
Show SMILES C[C@H](NC(=O)\C=C\c1ccccc1[N+]([O-])=O)c1nc2scc(C)c2c(=O)o1
Show InChI InChI=1S/C18H15N3O5S/c1-10-9-27-17-15(10)18(23)26-16(20-17)11(2)19-14(22)8-7-12-5-3-4-6-13(12)21(24)25/h3-9,11H,1-2H3,(H,19,22)/b8-7+/t11-/m0/s1
n/an/a 76n/an/an/an/an/an/a
SmithKline Beecham Pharmaceuticals
Curated by ChEMBL
Assay Description
Inhibitory activity against Varicella Zoster Virus (VZV) protease was determined using quenched fluorescence assay
Bioorg Med Chem Lett 9: 443-8 (1999)
BindingDB Entry DOI: 10.7270/Q2ZC822V
Human herpesvirus 4 protease/capsid scaffold protein
(Epstein-Barr virus (strain B95-8) (HHV-4) (Human h...)
BDBM50075141
((E)-N-[(S)-1-(5-Methyl-4-oxo-4H-thieno[2,3-d][1,3]...)
Show SMILES C[C@H](NC(=O)\C=C\c1ccccc1[N+]([O-])=O)c1nc2scc(C)c2c(=O)o1
Show InChI InChI=1S/C18H15N3O5S/c1-10-9-27-17-15(10)18(23)26-16(20-17)11(2)19-14(22)8-7-12-5-3-4-6-13(12)21(24)25/h3-9,11H,1-2H3,(H,19,22)/b8-7+/t11-/m0/s1
n/an/a 2.20E+3n/an/an/an/an/an/a
SmithKline Beecham Pharmaceuticals
Curated by ChEMBL
Assay Description
Inhibitory activity against cytomegalovirus (CMV) protease was determined using quenched fluorescence assay
Bioorg Med Chem Lett 9: 443-8 (1999)
BindingDB Entry DOI: 10.7270/Q2ZC822V
Human herpesvirus 2 protease
(Human herpesvirus 2 (strain HG52) (HHV-2) (Human h...)
BDBM50075141
((E)-N-[(S)-1-(5-Methyl-4-oxo-4H-thieno[2,3-d][1,3]...)
Show SMILES C[C@H](NC(=O)\C=C\c1ccccc1[N+]([O-])=O)c1nc2scc(C)c2c(=O)o1
Show InChI InChI=1S/C18H15N3O5S/c1-10-9-27-17-15(10)18(23)26-16(20-17)11(2)19-14(22)8-7-12-5-3-4-6-13(12)21(24)25/h3-9,11H,1-2H3,(H,19,22)/b8-7+/t11-/m0/s1
n/an/a 720n/an/an/an/an/an/a
SmithKline Beecham Pharmaceuticals
Curated by ChEMBL
Assay Description
Inhibitory activity against herpes simplex virus type 2 (HSV-2) protease was determined using quenched fluorescence assay
Bioorg Med Chem Lett 9: 443-8 (1999)
BindingDB Entry DOI: 10.7270/Q2ZC822V