null
SMILES: C[C@H](NC(=O)\C=C\C(=O)c1ccc(Cl)cc1)c1nc2scc(C)c2c(=O)o1
InChI Key: InChIKey=KAVMVYOXTABMCL-AEZGRPFRSA-N
Activity Spreadsheet -- Enzyme Inhibition Constant Data from BindingDB
Found 3 hits for monomerid = 50075180
Trg + Lig
Ki
nM
ΔG°
kcal/mole
IC50
nM
Kd
nM
EC50/IC50
nM
koff
s-1
kon
M-1s-1
pHTemp
°C
Genome polyprotein
(Human rhinovirus B)
BDBM50075180
((E)-4-(4-Chloro-phenyl)-4-oxo-but-2-enoic acid [(S...)
Show SMILES C[C@H](NC(=O)\C=C\C(=O)c1ccc(Cl)cc1)c1nc2scc(C)c2c(=O)o1
Show InChI InChI=1S/C19H15ClN2O4S/c1-10-9-27-18-16(10)19(25)26-17(22-18)11(2)21-15(24)8-7-14(23)12-3-5-13(20)6-4-12/h3-9,11H,1-2H3,(H,21,24)/b8-7+/t11-/m0/s1
n/an/a 3.20E+3n/an/an/an/an/an/a
SmithKline Beecham Pharmaceuticals
Curated by ChEMBL
Assay Description
Inhibitory activity of the compound against varicella zoster virus (VZV) protease
Bioorg Med Chem Lett 9: 449-52 (1999)
BindingDB Entry DOI: 10.7270/Q2TM799P
Capsid scaffolding protein
(Human cytomegalovirus (strain AD169) (HHV-5) (Huma...)
BDBM50075180
((E)-4-(4-Chloro-phenyl)-4-oxo-but-2-enoic acid [(S...)
Show SMILES C[C@H](NC(=O)\C=C\C(=O)c1ccc(Cl)cc1)c1nc2scc(C)c2c(=O)o1
Show InChI InChI=1S/C19H15ClN2O4S/c1-10-9-27-18-16(10)19(25)26-17(22-18)11(2)21-15(24)8-7-14(23)12-3-5-13(20)6-4-12/h3-9,11H,1-2H3,(H,21,24)/b8-7+/t11-/m0/s1
n/an/a 60n/an/an/an/an/an/a
SmithKline Beecham Pharmaceuticals
Curated by ChEMBL
Assay Description
Inhibitory activity against cytomegalovirus protease (CMV)
Bioorg Med Chem Lett 9: 449-52 (1999)
BindingDB Entry DOI: 10.7270/Q2TM799P
Capsid scaffolding protein
(Human herpesvirus 2 (strain HG52) (HHV-2) (Human h...)
BDBM50075180
((E)-4-(4-Chloro-phenyl)-4-oxo-but-2-enoic acid [(S...)
Show SMILES C[C@H](NC(=O)\C=C\C(=O)c1ccc(Cl)cc1)c1nc2scc(C)c2c(=O)o1
Show InChI InChI=1S/C19H15ClN2O4S/c1-10-9-27-18-16(10)19(25)26-17(22-18)11(2)21-15(24)8-7-14(23)12-3-5-13(20)6-4-12/h3-9,11H,1-2H3,(H,21,24)/b8-7+/t11-/m0/s1
n/an/a 1.50E+4n/an/an/an/an/an/a
SmithKline Beecham Pharmaceuticals
Curated by ChEMBL
Assay Description
Inhibitory activity against herpes simplex virus protease (HSV-2)
Bioorg Med Chem Lett 9: 449-52 (1999)
BindingDB Entry DOI: 10.7270/Q2TM799P