BDBM50075592 CHEMBL3415565
SMILES: Fc1ccccc1CNCCCCCCCN1C(=O)c2ccccc2C1=O
InChI Key: InChIKey=ABMUIKNLWXQBLZ-UHFFFAOYSA-N
Data: 3 IC50
Activity Spreadsheet -- Enzyme Inhibition Constant Data from BindingDB
Found 3 hits for monomerid = 50075592
Trg + Lig
Ki
nM
ΔG°
kcal/mole
IC50
nM
Kd
nM
EC50/IC50
nM
koff
s-1
kon
M-1s-1
pHTemp
°C
Butyrylcholinesterase (BuChE)
(Equus caballus (Horse))
BDBM50075592
(CHEMBL3415565)
Show SMILES Fc1ccccc1CNCCCCCCCN1C(=O)c2ccccc2C1=O
Show InChI InChI=1S/C22H25FN2O2/c23-20-13-7-4-10-17(20)16-24-14-8-2-1-3-9-15-25-21(26)18-11-5-6-12-19(18)22(25)27/h4-7,10-13,24H,1-3,8-9,14-16H2
n/an/a 2.38E+3n/an/an/an/an/an/a
Jagiellonian University Medical College
Curated by ChEMBL
Assay Description
Inhibition of equine serum BuChE after 5 mins by Ellman's method
Eur J Med Chem 92: 738-49 (2015)
Article DOI: 10.1016/j.ejmech.2015.01.027
BindingDB Entry DOI: 10.7270/Q23T9JXZ
Acetylcholinesterase
(Homo sapiens (Human))
BDBM50075592
(CHEMBL3415565)
Show SMILES Fc1ccccc1CNCCCCCCCN1C(=O)c2ccccc2C1=O
Show InChI InChI=1S/C22H25FN2O2/c23-20-13-7-4-10-17(20)16-24-14-8-2-1-3-9-15-25-21(26)18-11-5-6-12-19(18)22(25)27/h4-7,10-13,24H,1-3,8-9,14-16H2
NCI pathway
Reactome pathway
n/an/a 329n/an/an/an/an/an/a
Jagiellonian University Medical College
Curated by ChEMBL
Assay Description
Inhibition of human recombinant AChE after 5 mins by Ellman's method
Eur J Med Chem 92: 738-49 (2015)
Article DOI: 10.1016/j.ejmech.2015.01.027
BindingDB Entry DOI: 10.7270/Q23T9JXZ
Acetylcholinesterase
(Electrophorus electricus (Electric eel))
BDBM50075592
(CHEMBL3415565)
Show SMILES Fc1ccccc1CNCCCCCCCN1C(=O)c2ccccc2C1=O
Show InChI InChI=1S/C22H25FN2O2/c23-20-13-7-4-10-17(20)16-24-14-8-2-1-3-9-15-25-21(26)18-11-5-6-12-19(18)22(25)27/h4-7,10-13,24H,1-3,8-9,14-16H2
n/an/a 119n/an/an/an/an/an/a
Jagiellonian University Medical College
Curated by ChEMBL
Assay Description
Inhibition of Electrophorus electricus AChE after 5 mins by Ellman's method
Eur J Med Chem 92: 738-49 (2015)
Article DOI: 10.1016/j.ejmech.2015.01.027
BindingDB Entry DOI: 10.7270/Q23T9JXZ