BDBM50075642 CHEMBL3415568
SMILES: Fc1ccc(CNCCCCCN2C(=O)c3ccccc3C2=O)cc1
InChI Key: InChIKey=HXEPFYKTZGQERY-UHFFFAOYSA-N
Data: 2 IC50
Activity Spreadsheet -- Enzyme Inhibition Constant Data from BindingDB
Found 2 hits for monomerid = 50075642
Trg + Lig
Ki
nM
ΔG°
kcal/mole
IC50
nM
Kd
nM
EC50/IC50
nM
koff
s-1
kon
M-1s-1
pHTemp
°C
Acetylcholinesterase
(Homo sapiens (Human))
BDBM50075642
(CHEMBL3415568)
Show SMILES Fc1ccc(CNCCCCCN2C(=O)c3ccccc3C2=O)cc1
Show InChI InChI=1S/C20H21FN2O2/c21-16-10-8-15(9-11-16)14-22-12-4-1-5-13-23-19(24)17-6-2-3-7-18(17)20(23)25/h2-3,6-11,22H,1,4-5,12-14H2
NCI pathway
Reactome pathway
n/an/a 268n/an/an/an/an/an/a
Jagiellonian University Medical College
Curated by ChEMBL
Assay Description
Inhibition of human recombinant AChE after 5 mins by Ellman's method
Eur J Med Chem 92: 738-49 (2015)
Article DOI: 10.1016/j.ejmech.2015.01.027
BindingDB Entry DOI: 10.7270/Q23T9JXZ
Acetylcholinesterase
(Electrophorus electricus (Electric eel))
BDBM50075642
(CHEMBL3415568)
Show SMILES Fc1ccc(CNCCCCCN2C(=O)c3ccccc3C2=O)cc1
Show InChI InChI=1S/C20H21FN2O2/c21-16-10-8-15(9-11-16)14-22-12-4-1-5-13-23-19(24)17-6-2-3-7-18(17)20(23)25/h2-3,6-11,22H,1,4-5,12-14H2
n/an/a 219n/an/an/an/an/an/a
Jagiellonian University Medical College
Curated by ChEMBL
Assay Description
Inhibition of Electrophorus electricus AChE after 5 mins by Ellman's method
Eur J Med Chem 92: 738-49 (2015)
Article DOI: 10.1016/j.ejmech.2015.01.027
BindingDB Entry DOI: 10.7270/Q23T9JXZ