BDBM50075676 CHEMBL3415563
SMILES: Fc1ccccc1CNCCCCCN1C(=O)c2ccccc2C1=O
InChI Key: InChIKey=VUMWKZRTOJCTDT-UHFFFAOYSA-N
Data: 2 IC50
Activity Spreadsheet -- Enzyme Inhibition Constant Data from BindingDB
Found 2 hits for monomerid = 50075676
Trg + Lig
Ki
nM
ΔG°
kcal/mole
IC50
nM
Kd
nM
EC50/IC50
nM
koff
s-1
kon
M-1s-1
pHTemp
°C
Acetylcholinesterase
(Homo sapiens (Human))
BDBM50075676
(CHEMBL3415563)
Show SMILES Fc1ccccc1CNCCCCCN1C(=O)c2ccccc2C1=O
Show InChI InChI=1S/C20H21FN2O2/c21-18-11-5-2-8-15(18)14-22-12-6-1-7-13-23-19(24)16-9-3-4-10-17(16)20(23)25/h2-5,8-11,22H,1,6-7,12-14H2
NCI pathway
Reactome pathway
n/an/a 168n/an/an/an/an/an/a
Jagiellonian University Medical College
Curated by ChEMBL
Assay Description
Inhibition of human recombinant AChE after 5 mins by Ellman's method
Eur J Med Chem 92: 738-49 (2015)
Article DOI: 10.1016/j.ejmech.2015.01.027
BindingDB Entry DOI: 10.7270/Q23T9JXZ
Acetylcholinesterase
(Electrophorus electricus (Electric eel))
BDBM50075676
(CHEMBL3415563)
Show SMILES Fc1ccccc1CNCCCCCN1C(=O)c2ccccc2C1=O
Show InChI InChI=1S/C20H21FN2O2/c21-18-11-5-2-8-15(18)14-22-12-6-1-7-13-23-19(24)16-9-3-4-10-17(16)20(23)25/h2-5,8-11,22H,1,6-7,12-14H2
n/an/a 41n/an/an/an/an/an/a
Jagiellonian University Medical College
Curated by ChEMBL
Assay Description
Inhibition of Electrophorus electricus AChE after 5 mins by Ellman's method
Eur J Med Chem 92: 738-49 (2015)
Article DOI: 10.1016/j.ejmech.2015.01.027
BindingDB Entry DOI: 10.7270/Q23T9JXZ