BDBM50075747 CHEMBL3415597
SMILES: Cc1nc(Nc2cc(N[C@@H]3CCCC[C@@H]3N)cnc2C(N)=O)cc(OCC(C)(C)O)n1
InChI Key: InChIKey=GKCOFLVDCMKDGE-LSDHHAIUSA-N
Data: 2 IC50
Activity Spreadsheet -- Enzyme Inhibition Constant Data from BindingDB
Found 2 hits for monomerid = 50075747
Trg + Lig
Ki
nM
ΔG°
kcal/mole
IC50
nM
Kd
nM
EC50/IC50
nM
koff
s-1
kon
M-1s-1
pHTemp
°C
Potassium voltage-gated channel subfamily H member 2
(Homo sapiens (Human))
BDBM50075747
(CHEMBL3415597)
Show SMILES Cc1nc(Nc2cc(N[C@@H]3CCCC[C@@H]3N)cnc2C(N)=O)cc(OCC(C)(C)O)n1 |r|
Show InChI InChI=1S/C21H31N7O3/c1-12-25-17(9-18(26-12)31-11-21(2,3)30)28-16-8-13(10-24-19(16)20(23)29)27-15-7-5-4-6-14(15)22/h8-10,14-15,27,30H,4-7,11,22H2,1-3H3,(H2,23,29)(H,25,26,28)/t14-,15+/m0/s1
Reactome pathway
n/an/a 1.80E+4n/an/an/an/an/an/a
Merck & Co., Inc.
Curated by ChEMBL
Assay Description
Inhibition of ERG channel expressed in human embryonic kidney cells assessed as tail current amplitude measured for 3 to 30 mins by PatchXpress elect...
J Med Chem 58: 1929-39 (2015)
Article DOI: 10.1021/jm5018169
BindingDB Entry DOI: 10.7270/Q2028T7D
Tyrosine-protein kinase SYK
(Homo sapiens (Human))
BDBM50075747
(CHEMBL3415597)
Show SMILES Cc1nc(Nc2cc(N[C@@H]3CCCC[C@@H]3N)cnc2C(N)=O)cc(OCC(C)(C)O)n1 |r|
Show InChI InChI=1S/C21H31N7O3/c1-12-25-17(9-18(26-12)31-11-21(2,3)30)28-16-8-13(10-24-19(16)20(23)29)27-15-7-5-4-6-14(15)22/h8-10,14-15,27,30H,4-7,11,22H2,1-3H3,(H2,23,29)(H,25,26,28)/t14-,15+/m0/s1
NCI pathway
Reactome pathway
n/an/a 0.200n/an/an/an/an/an/a
Merck & Co., Inc.
Curated by ChEMBL
Assay Description
Inhibition of full-length GST-tagged human Syk preincubated for 10 mins followed by peptide substrate/ATP addition measured after 45 mins by TR-FRET ...
J Med Chem 58: 1929-39 (2015)
Article DOI: 10.1021/jm5018169
BindingDB Entry DOI: 10.7270/Q2028T7D