BDBM50076688 CHEMBL266473::trans-7-Ethyl-4-trifluoromethyl-5,6,7,8-tetrahydro-1-oxa-8-aza-anthracen-2-one
SMILES: CCC1CCc2cc3c(cc(=O)oc3cc2N1)C(F)(F)F
InChI Key: InChIKey=YNKWXKPDLGJQBC-UHFFFAOYSA-N
Data: 2 IC50  1 EC50
Activity Spreadsheet -- Enzyme Inhibition Constant Data from BindingDB
Found 3 hits for monomerid = 50076688
Trg + Lig
Ki
nM
ΔG°
kcal/mole
IC50
nM
Kd
nM
EC50/IC50
nM
koff
s-1
kon
M-1s-1
pHTemp
°C
Androgen receptor
(Homo sapiens (Human))
BDBM50076688
(CHEMBL266473 | trans-7-Ethyl-4-trifluoromethyl-5,6...)
Show SMILES CCC1CCc2cc3c(cc(=O)oc3cc2N1)C(F)(F)F
Show InChI InChI=1S/C15H14F3NO2/c1-2-9-4-3-8-5-10-11(15(16,17)18)6-14(20)21-13(10)7-12(8)19-9/h5-7,9,19H,2-4H2,1H3
NCI pathway
Reactome pathway
n/an/a 1n/an/an/an/an/an/a
Ligand Pharmaceuticals
Curated by ChEMBL
Assay Description
In vitro binding affinity at human androgen receptor transfected into COS cells.
Bioorg Med Chem Lett 9: 1003-8 (1999)
BindingDB Entry DOI: 10.7270/Q2JS9PM8
Androgen receptor
(Homo sapiens (Human))
BDBM50076688
(CHEMBL266473 | trans-7-Ethyl-4-trifluoromethyl-5,6...)
Show SMILES CCC1CCc2cc3c(cc(=O)oc3cc2N1)C(F)(F)F
Show InChI InChI=1S/C15H14F3NO2/c1-2-9-4-3-8-5-10-11(15(16,17)18)6-14(20)21-13(10)7-12(8)19-9/h5-7,9,19H,2-4H2,1H3
NCI pathway
Reactome pathway
n/an/a>10n/an/an/an/an/an/a
Ligand Pharmaceuticals
Curated by ChEMBL
Assay Description
In vitro antagonistic activity against human androgen receptor using cotransfection assay in CV-1 cells; Not active.
Bioorg Med Chem Lett 9: 1003-8 (1999)
BindingDB Entry DOI: 10.7270/Q2JS9PM8
Androgen receptor
(Homo sapiens (Human))
BDBM50076688
(CHEMBL266473 | trans-7-Ethyl-4-trifluoromethyl-5,6...)
Show SMILES CCC1CCc2cc3c(cc(=O)oc3cc2N1)C(F)(F)F
Show InChI InChI=1S/C15H14F3NO2/c1-2-9-4-3-8-5-10-11(15(16,17)18)6-14(20)21-13(10)7-12(8)19-9/h5-7,9,19H,2-4H2,1H3
NCI pathway
Reactome pathway
n/an/an/an/a 7n/an/an/an/a
Ligand Pharmaceuticals
Curated by ChEMBL
Assay Description
In vitro binding affinity at human androgen receptor transfected into COS cells.
Bioorg Med Chem Lett 9: 1003-8 (1999)
BindingDB Entry DOI: 10.7270/Q2JS9PM8