BDBM50077086 4-[(4-Cyclopentyl-piperazin-1-yl)-phenyl-methyl]-N,N-diethyl-benzamide::CHEMBL281471
SMILES: CCN(CC)C(=O)c1ccc(cc1)C(N1CCN(CC1)C1CCCC1)c1ccccc1
InChI Key: InChIKey=VOPCWAQEKGAZOJ-UHFFFAOYSA-N
Data: 1 IC50
Activity Spreadsheet -- Enzyme Inhibition Constant Data from BindingDB
Found 1 hit for monomerid = 50077086
Trg + Lig
Ki
nM
ΔG°
kcal/mole
IC50
nM
Kd
nM
EC50/IC50
nM
koff
s-1
kon
M-1s-1
pHTemp
°C
Delta-type opioid receptor
(Homo sapiens (Human))
BDBM50077086
(4-[(4-Cyclopentyl-piperazin-1-yl)-phenyl-methyl]-N...)
Show SMILES CCN(CC)C(=O)c1ccc(cc1)C(N1CCN(CC1)C1CCCC1)c1ccccc1
Show InChI InChI=1S/C27H37N3O/c1-3-28(4-2)27(31)24-16-14-23(15-17-24)26(22-10-6-5-7-11-22)30-20-18-29(19-21-30)25-12-8-9-13-25/h5-7,10-11,14-17,25-26H,3-4,8-9,12-13,18-21H2,1-2H3
Reactome pathway
n/an/a 5.80n/an/an/an/an/an/a
Organon Laboratories Ltd.
Curated by ChEMBL
Assay Description
Inhibition of binding of [3H]- -naltrindole (0.15 nM) to membranes from CHO cells expressing Opioid receptor delta 1
Bioorg Med Chem Lett 9: 1329-34 (1999)
BindingDB Entry DOI: 10.7270/Q2V40TCM