BDBM50077093 4-[(4-Allyl-[1,4]diazepan-1-yl)-phenyl-methyl]-N,N-diethyl-benzamide::CHEMBL28010
SMILES: CCN(CC)C(=O)c1ccc(cc1)C(N1CCCN(CC=C)CC1)c1ccccc1
InChI Key: InChIKey=YXROPZCHCADPMJ-UHFFFAOYSA-N
Data: 1 IC50
Activity Spreadsheet -- Enzyme Inhibition Constant Data from BindingDB
Found 1 hit for monomerid = 50077093
Trg + Lig
Ki
nM
ΔG°
kcal/mole
IC50
nM
Kd
nM
EC50/IC50
nM
koff
s-1
kon
M-1s-1
pHTemp
°C
Delta-type opioid receptor
(Homo sapiens (Human))
BDBM50077093
(4-[(4-Allyl-[1,4]diazepan-1-yl)-phenyl-methyl]-N,N...)
Show SMILES CCN(CC)C(=O)c1ccc(cc1)C(N1CCCN(CC=C)CC1)c1ccccc1
Show InChI InChI=1S/C26H35N3O/c1-4-17-27-18-10-19-29(21-20-27)25(22-11-8-7-9-12-22)23-13-15-24(16-14-23)26(30)28(5-2)6-3/h4,7-9,11-16,25H,1,5-6,10,17-21H2,2-3H3
Reactome pathway
n/an/a 13n/an/an/an/an/an/a
Organon Laboratories Ltd.
Curated by ChEMBL
Assay Description
Compound was tested for inhibition of binding of [3H]- -naltrindole (0.15 nM) to membranes from CHO cells expressing human delta opioid receptor
Bioorg Med Chem Lett 9: 1329-34 (1999)
BindingDB Entry DOI: 10.7270/Q2V40TCM