null
SMILES: CCCCc1ccc(cc1)C#Cc1ccc(s1)S(=O)(=O)N[C@H](Cc1c[nH]c2ccccc12)C(O)=O
InChI Key: InChIKey=OGKMZGGDXJSOLE-RUZDIDTESA-N
Activity Spreadsheet -- Enzyme Inhibition Constant Data from BindingDB
Found 2 hits for monomerid = 50077155
Trg + Lig
Ki
nM
ΔG°
kcal/mole
IC50
nM
Kd
nM
EC50/IC50
nM
koff
s-1
kon
M-1s-1
pHTemp
°C
72 kDa type IV collagenase
(Homo sapiens (Human))
BDBM50077155
((R)-2-[5-(4-Butyl-phenylethynyl)-thiophene-2-sulfo...)
Show SMILES CCCCc1ccc(cc1)C#Cc1ccc(s1)S(=O)(=O)N[C@H](Cc1c[nH]c2ccccc12)C(O)=O
Show InChI InChI=1S/C27H26N2O4S2/c1-2-3-6-19-9-11-20(12-10-19)13-14-22-15-16-26(34-22)35(32,33)29-25(27(30)31)17-21-18-28-24-8-5-4-7-23(21)24/h4-5,7-12,15-16,18,25,28-29H,2-3,6,17H2,1H3,(H,30,31)/t25-/m1/s1
Reactome pathway
n/an/a 4.40n/an/an/an/an/an/a
Shionogi & Company, Ltd.
Curated by ChEMBL
Assay Description
Inhibitory activity against Matrix metalloproteinase-2 (concentration required for 50% inhibition of enzyme activity)
J Med Chem 42: 1723-38 (1999)
Article DOI: 10.1021/jm980514x
BindingDB Entry DOI: 10.7270/Q2KP81BQ
Matrix metalloproteinase-9
(Homo sapiens (Human))
BDBM50077155
((R)-2-[5-(4-Butyl-phenylethynyl)-thiophene-2-sulfo...)
Show SMILES CCCCc1ccc(cc1)C#Cc1ccc(s1)S(=O)(=O)N[C@H](Cc1c[nH]c2ccccc12)C(O)=O
Show InChI InChI=1S/C27H26N2O4S2/c1-2-3-6-19-9-11-20(12-10-19)13-14-22-15-16-26(34-22)35(32,33)29-25(27(30)31)17-21-18-28-24-8-5-4-7-23(21)24/h4-5,7-12,15-16,18,25,28-29H,2-3,6,17H2,1H3,(H,30,31)/t25-/m1/s1
Reactome pathway
n/an/a 2.70E+3n/an/an/an/an/an/a
Shionogi & Company, Ltd.
Curated by ChEMBL
Assay Description
Inhibitory activity against Matrix metalloproteinase-9 (concentration required for 50% inhibition of enzyme activity)
J Med Chem 42: 1723-38 (1999)
Article DOI: 10.1021/jm980514x
BindingDB Entry DOI: 10.7270/Q2KP81BQ