null
SMILES: [H][C@@]12CCCN1C(=O)[C@H](CCCNC(N)=N)NC(=O)[C@]1([H])CSSC[C@H](NC(=O)[C@@H](N)CC(O)=O)C(=O)N[C@@H](CC(C)C)C(=O)NCC(=O)N[C@@H](Cc3ccccc3)C(=O)N[C@@H](Cc3c[nH]c4ccccc34)C(=O)N[C@@H](CCCNC(N)=N)C(=O)N[C@@H](CCCCN)C(=O)N[C@@]3([H])CSSC[C@]([H])(NC(=O)[C@@H](NC(=O)[C@H](CC(C)C)NC(=O)[C@H](CC(N)=O)NC2=O)C(C)C)C(=O)N[C@@H](CO)C(=O)N[C@@H](CCCNC(N)=N)C(=O)N[C@@]([H])([C@@H](C)O)C(=O)N[C@@H](Cc2cnc[nH]2)C(=O)N[C@@H](CCCCN)C(=O)N[C@@H](Cc2c[nH]c4ccccc24)C(=O)N[C@@H](CSSC[C@]([H])(NC(=O)[C@H](CCCCN)NC(=O)[C@H](CC(O)=O)NC(=O)[C@H](CC(N)=O)NC(=O)[C@H](CC(O)=O)NC(=O)[C@]2([H])CCCN2C(=O)[C@@]([H])(NC3=O)[C@@H](C)CC)C(=O)N1)C(=O)N[C@@H](CCCCN)C(=O)N[C@@H](Cc1ccc(O)cc1)C(=O)N[C@@H](C(C)C)C(=O)N[C@@H](Cc1ccccc1)C(N)=O
InChI Key: InChIKey=VBPFCFPZENVMHX-UOZCUAPTSA-N
Activity Spreadsheet -- Enzyme Inhibition Constant Data from BindingDB
Found 3 hits for monomerid = 50077800
Trg + Lig
Ki
nM
ΔG°
kcal/mole
IC50
nM
Kd
nM
EC50/IC50
nM
koff
s-1
kon
M-1s-1
pHTemp
°C
Sodium channel protein type 5 subunit alpha
(Homo sapiens (Human))
BDBM50077800
(CHEMBL3416936)
Show SMILES [H][C@@]12CCCN1C(=O)[C@H](CCCNC(N)=N)NC(=O)[C@]1([H])CSSC[C@H](NC(=O)[C@@H](N)CC(O)=O)C(=O)N[C@@H](CC(C)C)C(=O)NCC(=O)N[C@@H](Cc3ccccc3)C(=O)N[C@@H](Cc3c[nH]c4ccccc34)C(=O)N[C@@H](CCCNC(N)=N)C(=O)N[C@@H](CCCCN)C(=O)N[C@@]3([H])CSSC[C@]([H])(NC(=O)[C@@H](NC(=O)[C@H](CC(C)C)NC(=O)[C@H](CC(N)=O)NC2=O)C(C)C)C(=O)N[C@@H](CO)C(=O)N[C@@H](CCCNC(N)=N)C(=O)N[C@@]([H])([C@@H](C)O)C(=O)N[C@@H](Cc2cnc[nH]2)C(=O)N[C@@H](CCCCN)C(=O)N[C@@H](Cc2c[nH]c4ccccc24)C(=O)N[C@@H](CSSC[C@]([H])(NC(=O)[C@H](CCCCN)NC(=O)[C@H](CC(O)=O)NC(=O)[C@H](CC(N)=O)NC(=O)[C@H](CC(O)=O)NC(=O)[C@]2([H])CCCN2C(=O)[C@@]([H])(NC3=O)[C@@H](C)CC)C(=O)N1)C(=O)N[C@@H](CCCCN)C(=O)N[C@@H](Cc1ccc(O)cc1)C(=O)N[C@@H](C(C)C)C(=O)N[C@@H](Cc1ccccc1)C(N)=O |r|
Show InChI InChI=1S/C182H272N54O45S6/c1-12-95(10)145-179(281)236-65-35-52-136(236)174(276)222-127(78-142(247)248)163(265)219-124(75-137(188)240)160(262)220-126(77-141(245)246)162(264)208-112(47-26-30-60-186)154(256)226-132-87-285-283-85-130(167(269)211-110(45-24-28-58-184)151(253)216-120(70-99-53-55-103(239)56-54-99)165(267)232-143(93(6)7)175(277)213-116(147(190)249)68-97-36-15-13-16-37-97)228-158(260)122(72-101-80-202-108-43-22-20-41-105(101)108)217-152(254)109(44-23-27-57-183)207-159(261)123(73-102-81-197-90-204-102)223-177(279)146(96(11)238)234-155(257)114(49-32-62-199-181(193)194)210-166(268)128(83-237)224-170(272)133-88-286-287-89-134(172(274)233-145)227-153(255)111(46-25-29-59-185)206-150(252)113(48-31-61-198-180(191)192)209-157(259)121(71-100-79-201-107-42-21-19-40-104(100)107)218-156(258)119(69-98-38-17-14-18-39-98)205-139(242)82-203-149(251)117(66-91(2)3)214-169(271)129(225-148(250)106(187)74-140(243)244)84-282-284-86-131(229-171(132)273)168(270)212-115(50-33-63-200-182(195)196)178(280)235-64-34-51-135(235)173(275)221-125(76-138(189)241)161(263)215-118(67-92(4)5)164(266)231-144(94(8)9)176(278)230-133/h13-22,36-43,53-56,79-81,90-96,106,109-136,143-146,201-202,237-239H,12,23-35,44-52,57-78,82-89,183-187H2,1-11H3,(H2,188,240)(H2,189,241)(H2,190,249)(H,197,204)(H,203,251)(H,205,242)(H,206,252)(H,207,261)(H,208,264)(H,209,259)(H,210,268)(H,211,269)(H,212,270)(H,213,277)(H,214,271)(H,215,263)(H,216,253)(H,217,254)(H,218,258)(H,219,265)(H,220,262)(H,221,275)(H,222,276)(H,223,279)(H,224,272)(H,225,250)(H,226,256)(H,227,255)(H,228,260)(H,229,273)(H,230,278)(H,231,266)(H,232,267)(H,233,274)(H,234,257)(H,243,244)(H,245,246)(H,247,248)(H4,191,192,198)(H4,193,194,199)(H4,195,196,200)/t95-,96+,106-,109-,110-,111-,112-,113-,114-,115-,116-,117-,118-,119-,120-,121-,122-,123-,124-,125-,126-,127-,128-,129-,130-,131-,132-,133-,134-,135-,136-,143-,144-,145-,146-/m0/s1
n/an/a 3.40E+3n/an/an/an/an/an/a
Amgen Inc.
Curated by ChEMBL
Assay Description
Inhibition of human NaV1.5 at -140 mV holding potential by whole-cell patch clamp assay
J Med Chem 58: 2299-314 (2015)
Article DOI: 10.1021/jm501765v
BindingDB Entry DOI: 10.7270/Q2F47QVK
Sodium channel protein type 9 subunit alpha
(Homo sapiens (Human))
BDBM50077800
(CHEMBL3416936)
Show SMILES [H][C@@]12CCCN1C(=O)[C@H](CCCNC(N)=N)NC(=O)[C@]1([H])CSSC[C@H](NC(=O)[C@@H](N)CC(O)=O)C(=O)N[C@@H](CC(C)C)C(=O)NCC(=O)N[C@@H](Cc3ccccc3)C(=O)N[C@@H](Cc3c[nH]c4ccccc34)C(=O)N[C@@H](CCCNC(N)=N)C(=O)N[C@@H](CCCCN)C(=O)N[C@@]3([H])CSSC[C@]([H])(NC(=O)[C@@H](NC(=O)[C@H](CC(C)C)NC(=O)[C@H](CC(N)=O)NC2=O)C(C)C)C(=O)N[C@@H](CO)C(=O)N[C@@H](CCCNC(N)=N)C(=O)N[C@@]([H])([C@@H](C)O)C(=O)N[C@@H](Cc2cnc[nH]2)C(=O)N[C@@H](CCCCN)C(=O)N[C@@H](Cc2c[nH]c4ccccc24)C(=O)N[C@@H](CSSC[C@]([H])(NC(=O)[C@H](CCCCN)NC(=O)[C@H](CC(O)=O)NC(=O)[C@H](CC(N)=O)NC(=O)[C@H](CC(O)=O)NC(=O)[C@]2([H])CCCN2C(=O)[C@@]([H])(NC3=O)[C@@H](C)CC)C(=O)N1)C(=O)N[C@@H](CCCCN)C(=O)N[C@@H](Cc1ccc(O)cc1)C(=O)N[C@@H](C(C)C)C(=O)N[C@@H](Cc1ccccc1)C(N)=O |r|
Show InChI InChI=1S/C182H272N54O45S6/c1-12-95(10)145-179(281)236-65-35-52-136(236)174(276)222-127(78-142(247)248)163(265)219-124(75-137(188)240)160(262)220-126(77-141(245)246)162(264)208-112(47-26-30-60-186)154(256)226-132-87-285-283-85-130(167(269)211-110(45-24-28-58-184)151(253)216-120(70-99-53-55-103(239)56-54-99)165(267)232-143(93(6)7)175(277)213-116(147(190)249)68-97-36-15-13-16-37-97)228-158(260)122(72-101-80-202-108-43-22-20-41-105(101)108)217-152(254)109(44-23-27-57-183)207-159(261)123(73-102-81-197-90-204-102)223-177(279)146(96(11)238)234-155(257)114(49-32-62-199-181(193)194)210-166(268)128(83-237)224-170(272)133-88-286-287-89-134(172(274)233-145)227-153(255)111(46-25-29-59-185)206-150(252)113(48-31-61-198-180(191)192)209-157(259)121(71-100-79-201-107-42-21-19-40-104(100)107)218-156(258)119(69-98-38-17-14-18-39-98)205-139(242)82-203-149(251)117(66-91(2)3)214-169(271)129(225-148(250)106(187)74-140(243)244)84-282-284-86-131(229-171(132)273)168(270)212-115(50-33-63-200-182(195)196)178(280)235-64-34-51-135(235)173(275)221-125(76-138(189)241)161(263)215-118(67-92(4)5)164(266)231-144(94(8)9)176(278)230-133/h13-22,36-43,53-56,79-81,90-96,106,109-136,143-146,201-202,237-239H,12,23-35,44-52,57-78,82-89,183-187H2,1-11H3,(H2,188,240)(H2,189,241)(H2,190,249)(H,197,204)(H,203,251)(H,205,242)(H,206,252)(H,207,261)(H,208,264)(H,209,259)(H,210,268)(H,211,269)(H,212,270)(H,213,277)(H,214,271)(H,215,263)(H,216,253)(H,217,254)(H,218,258)(H,219,265)(H,220,262)(H,221,275)(H,222,276)(H,223,279)(H,224,272)(H,225,250)(H,226,256)(H,227,255)(H,228,260)(H,229,273)(H,230,278)(H,231,266)(H,232,267)(H,233,274)(H,234,257)(H,243,244)(H,245,246)(H,247,248)(H4,191,192,198)(H4,193,194,199)(H4,195,196,200)/t95-,96+,106-,109-,110-,111-,112-,113-,114-,115-,116-,117-,118-,119-,120-,121-,122-,123-,124-,125-,126-,127-,128-,129-,130-,131-,132-,133-,134-,135-,136-,143-,144-,145-,146-/m0/s1
n/an/a 23n/an/an/an/an/an/a
Amgen Inc.
Curated by ChEMBL
Assay Description
Inhibition of human NaV1.7 at -140 mV holding potential by whole-cell patch clamp assay
J Med Chem 58: 2299-314 (2015)
Article DOI: 10.1021/jm501765v
BindingDB Entry DOI: 10.7270/Q2F47QVK
Sodium channel protein type 4 subunit alpha
(Homo sapiens (Human))
BDBM50077800
(CHEMBL3416936)
Show SMILES [H][C@@]12CCCN1C(=O)[C@H](CCCNC(N)=N)NC(=O)[C@]1([H])CSSC[C@H](NC(=O)[C@@H](N)CC(O)=O)C(=O)N[C@@H](CC(C)C)C(=O)NCC(=O)N[C@@H](Cc3ccccc3)C(=O)N[C@@H](Cc3c[nH]c4ccccc34)C(=O)N[C@@H](CCCNC(N)=N)C(=O)N[C@@H](CCCCN)C(=O)N[C@@]3([H])CSSC[C@]([H])(NC(=O)[C@@H](NC(=O)[C@H](CC(C)C)NC(=O)[C@H](CC(N)=O)NC2=O)C(C)C)C(=O)N[C@@H](CO)C(=O)N[C@@H](CCCNC(N)=N)C(=O)N[C@@]([H])([C@@H](C)O)C(=O)N[C@@H](Cc2cnc[nH]2)C(=O)N[C@@H](CCCCN)C(=O)N[C@@H](Cc2c[nH]c4ccccc24)C(=O)N[C@@H](CSSC[C@]([H])(NC(=O)[C@H](CCCCN)NC(=O)[C@H](CC(O)=O)NC(=O)[C@H](CC(N)=O)NC(=O)[C@H](CC(O)=O)NC(=O)[C@]2([H])CCCN2C(=O)[C@@]([H])(NC3=O)[C@@H](C)CC)C(=O)N1)C(=O)N[C@@H](CCCCN)C(=O)N[C@@H](Cc1ccc(O)cc1)C(=O)N[C@@H](C(C)C)C(=O)N[C@@H](Cc1ccccc1)C(N)=O |r|
Show InChI InChI=1S/C182H272N54O45S6/c1-12-95(10)145-179(281)236-65-35-52-136(236)174(276)222-127(78-142(247)248)163(265)219-124(75-137(188)240)160(262)220-126(77-141(245)246)162(264)208-112(47-26-30-60-186)154(256)226-132-87-285-283-85-130(167(269)211-110(45-24-28-58-184)151(253)216-120(70-99-53-55-103(239)56-54-99)165(267)232-143(93(6)7)175(277)213-116(147(190)249)68-97-36-15-13-16-37-97)228-158(260)122(72-101-80-202-108-43-22-20-41-105(101)108)217-152(254)109(44-23-27-57-183)207-159(261)123(73-102-81-197-90-204-102)223-177(279)146(96(11)238)234-155(257)114(49-32-62-199-181(193)194)210-166(268)128(83-237)224-170(272)133-88-286-287-89-134(172(274)233-145)227-153(255)111(46-25-29-59-185)206-150(252)113(48-31-61-198-180(191)192)209-157(259)121(71-100-79-201-107-42-21-19-40-104(100)107)218-156(258)119(69-98-38-17-14-18-39-98)205-139(242)82-203-149(251)117(66-91(2)3)214-169(271)129(225-148(250)106(187)74-140(243)244)84-282-284-86-131(229-171(132)273)168(270)212-115(50-33-63-200-182(195)196)178(280)235-64-34-51-135(235)173(275)221-125(76-138(189)241)161(263)215-118(67-92(4)5)164(266)231-144(94(8)9)176(278)230-133/h13-22,36-43,53-56,79-81,90-96,106,109-136,143-146,201-202,237-239H,12,23-35,44-52,57-78,82-89,183-187H2,1-11H3,(H2,188,240)(H2,189,241)(H2,190,249)(H,197,204)(H,203,251)(H,205,242)(H,206,252)(H,207,261)(H,208,264)(H,209,259)(H,210,268)(H,211,269)(H,212,270)(H,213,277)(H,214,271)(H,215,263)(H,216,253)(H,217,254)(H,218,258)(H,219,265)(H,220,262)(H,221,275)(H,222,276)(H,223,279)(H,224,272)(H,225,250)(H,226,256)(H,227,255)(H,228,260)(H,229,273)(H,230,278)(H,231,266)(H,232,267)(H,233,274)(H,234,257)(H,243,244)(H,245,246)(H,247,248)(H4,191,192,198)(H4,193,194,199)(H4,195,196,200)/t95-,96+,106-,109-,110-,111-,112-,113-,114-,115-,116-,117-,118-,119-,120-,121-,122-,123-,124-,125-,126-,127-,128-,129-,130-,131-,132-,133-,134-,135-,136-,143-,144-,145-,146-/m0/s1
n/an/a 240n/an/an/an/an/an/a
Amgen Inc.
Curated by ChEMBL
Assay Description
Inhibition of human NaV1.4 at -140 mV holding potential by whole-cell patch clamp assay
J Med Chem 58: 2299-314 (2015)
Article DOI: 10.1021/jm501765v
BindingDB Entry DOI: 10.7270/Q2F47QVK