BDBM50077911 CHEMBL3417232
SMILES: COc1cc2C(CCc2cc1Br)N[C@@H]1CC[C@](C1)(C(C)C)C(=O)N1CCc2ccc(cc2C1)C(F)(F)F
InChI Key: InChIKey=GIZBLHTXSSIYHP-IHCHDWFBSA-N
Data: 1 KI
Activity Spreadsheet -- Enzyme Inhibition Constant Data from BindingDB
Found 1 hit for monomerid = 50077911
Trg + Lig
Ki
nM
ΔG°
kcal/mole
IC50
nM
Kd
nM
EC50/IC50
nM
koff
s-1
kon
M-1s-1
pHTemp
°C
C-C chemokine receptor type 2
(Homo sapiens (Human))
BDBM50077911
(CHEMBL3417232)
Show SMILES COc1cc2C(CCc2cc1Br)N[C@@H]1CC[C@](C1)(C(C)C)C(=O)N1CCc2ccc(cc2C1)C(F)(F)F |r|
Show InChI InChI=1S/C29H34BrF3N2O2/c1-17(2)28(27(36)35-11-9-18-4-6-21(29(31,32)33)12-20(18)16-35)10-8-22(15-28)34-25-7-5-19-13-24(30)26(37-3)14-23(19)25/h4,6,12-14,17,22,25,34H,5,7-11,15-16H2,1-3H3/t22-,25?,28+/m1/s1
4.5n/an/an/an/an/an/an/an/a
Leiden University
Curated by ChEMBL
Assay Description
Displacement of 0.1 nM [125I]CCL2 from human CCR2 expressing human U2OS cell membrane by scintillation spectrometry
Eur J Med Chem 93: 121-34 (2015)
Article DOI: 10.1016/j.ejmech.2015.01.063
BindingDB Entry DOI: 10.7270/Q25M67DX