null
SMILES: CN1CCN(CC1)C1=Nc2ccccc2Nc2ccc(OS(C)(=O)=O)cc12
InChI Key: InChIKey=OUTHAVMRGGWPSK-UHFFFAOYSA-N
Activity Spreadsheet -- Enzyme Inhibition Constant Data from BindingDB
Found 5 hits for monomerid = 50078066
Trg + Lig
Ki
nM
ΔG°
kcal/mole
IC50
nM
Kd
nM
EC50/IC50
nM
koff
s-1
kon
M-1s-1
pHTemp
°C
5-hydroxytryptamine receptor 2C
(Rattus norvegicus (Rat))
BDBM50078066
(CHEMBL307163 | Methanesulfonic acid 11-(4-methyl-p...)
Show SMILES CN1CCN(CC1)C1=Nc2ccccc2Nc2ccc(OS(C)(=O)=O)cc12 |t:8|
Show InChI InChI=1S/C19H22N4O3S/c1-22-9-11-23(12-10-22)19-15-13-14(26-27(2,24)25)7-8-16(15)20-17-5-3-4-6-18(17)21-19/h3-8,13,20H,9-12H2,1-2H3
n/an/a 1.20E+3n/an/an/an/an/an/a
University of Göteborg
Curated by ChEMBL
Assay Description
Binding affinity towards 5-HT2C receptor from rat using [3H]-mesulergine as radioligand
J Med Chem 42: 2235-44 (1999)
Article DOI: 10.1021/jm991005d
BindingDB Entry DOI: 10.7270/Q2KH0MH7
Muscarinic acetylcholine receptor M1
(Homo sapiens (Human))
BDBM50078066
(CHEMBL307163 | Methanesulfonic acid 11-(4-methyl-p...)
Show SMILES CN1CCN(CC1)C1=Nc2ccccc2Nc2ccc(OS(C)(=O)=O)cc12 |t:8|
Show InChI InChI=1S/C19H22N4O3S/c1-22-9-11-23(12-10-22)19-15-13-14(26-27(2,24)25)7-8-16(15)20-17-5-3-4-6-18(17)21-19/h3-8,13,20H,9-12H2,1-2H3
n/an/a 1.00E+3n/an/an/an/an/an/a
University of Göteborg
Curated by ChEMBL
Assay Description
Inhibition of binding of 1.0 nM [3H]-pirenzepine to cloned human Muscarinic acetylcholine receptor M1 expressed in membranes from CHO-K1 cells
J Med Chem 42: 2235-44 (1999)
Article DOI: 10.1021/jm991005d
BindingDB Entry DOI: 10.7270/Q2KH0MH7
5-hydroxytryptamine receptor 2A
(Rattus norvegicus (rat))
BDBM50078066
(CHEMBL307163 | Methanesulfonic acid 11-(4-methyl-p...)
Show SMILES CN1CCN(CC1)C1=Nc2ccccc2Nc2ccc(OS(C)(=O)=O)cc12 |t:8|
Show InChI InChI=1S/C19H22N4O3S/c1-22-9-11-23(12-10-22)19-15-13-14(26-27(2,24)25)7-8-16(15)20-17-5-3-4-6-18(17)21-19/h3-8,13,20H,9-12H2,1-2H3
Reactome pathway
n/an/a 880n/an/an/an/an/an/a
University of Göteborg
Curated by ChEMBL
Assay Description
Binding affinity towards 5-hydroxytryptamine 2A receptor from rat frontal cortex using [3H]-ketanserin as radioligand
J Med Chem 42: 2235-44 (1999)
Article DOI: 10.1021/jm991005d
BindingDB Entry DOI: 10.7270/Q2KH0MH7
D(1A) dopamine receptor
(RAT)
BDBM50078066
(CHEMBL307163 | Methanesulfonic acid 11-(4-methyl-p...)
Show SMILES CN1CCN(CC1)C1=Nc2ccccc2Nc2ccc(OS(C)(=O)=O)cc12 |t:8|
Show InChI InChI=1S/C19H22N4O3S/c1-22-9-11-23(12-10-22)19-15-13-14(26-27(2,24)25)7-8-16(15)20-17-5-3-4-6-18(17)21-19/h3-8,13,20H,9-12H2,1-2H3
n/an/a 2.10E+3n/an/an/an/an/an/a
University of Göteborg
Curated by ChEMBL
Assay Description
Binding affinity towards D1 CNS receptor of rat corpus striatum using [3H]-SCH-23,390 as radioligand
J Med Chem 42: 2235-44 (1999)
Article DOI: 10.1021/jm991005d
BindingDB Entry DOI: 10.7270/Q2KH0MH7
D(2) dopamine receptor
(Rattus norvegicus (rat))
BDBM50078066
(CHEMBL307163 | Methanesulfonic acid 11-(4-methyl-p...)
Show SMILES CN1CCN(CC1)C1=Nc2ccccc2Nc2ccc(OS(C)(=O)=O)cc12 |t:8|
Show InChI InChI=1S/C19H22N4O3S/c1-22-9-11-23(12-10-22)19-15-13-14(26-27(2,24)25)7-8-16(15)20-17-5-3-4-6-18(17)21-19/h3-8,13,20H,9-12H2,1-2H3
Reactome pathway
n/an/a 920n/an/an/an/an/an/a
University of Göteborg
Curated by ChEMBL
Assay Description
Binding affinity towards Dopamine receptor D2 of rat corpus striatum using [3H]-spiperone as radioligand
J Med Chem 42: 2235-44 (1999)
Article DOI: 10.1021/jm991005d
BindingDB Entry DOI: 10.7270/Q2KH0MH7