BDBM50078221 CHEMBL3414674
SMILES: CC(C)CCCC1(C)CC(=O)c2cc(O)c(C)c(C)c2O1
InChI Key: InChIKey=HFCLCCGHBSBOEP-UHFFFAOYSA-N
Data: 1 Kd
Activity Spreadsheet -- Enzyme Inhibition Constant Data from BindingDB
Found 1 hit for monomerid = 50078221
Trg + Lig
Ki
nM
ΔG°
kcal/mole
IC50
nM
Kd
nM
EC50/IC50
nM
koff
s-1
kon
M-1s-1
pHTemp
°C
RAC-alpha serine/threonine-protein kinase
(Homo sapiens (Human))
BDBM50078221
(CHEMBL3414674)
Show SMILES CC(C)CCCC1(C)CC(=O)c2cc(O)c(C)c(C)c2O1
Show InChI InChI=1S/C18H26O3/c1-11(2)7-6-8-18(5)10-16(20)14-9-15(19)12(3)13(4)17(14)21-18/h9,11,19H,6-8,10H2,1-5H3
n/an/an/a 410n/an/an/an/an/a
The Ohio State University
Curated by ChEMBL
Assay Description
Binding affinity to GST-tagged PH domain of AKT (unknown origin) by surface Plasmon resonance spectroscopy
J Med Chem 58: 2290-8 (2015)
Article DOI: 10.1021/jm501751b
BindingDB Entry DOI: 10.7270/Q20V8FGX