BDBM50078222 CHEMBL3414673
SMILES: CC(C)CCCC1(C)CCc2cc(O)ccc2O1
InChI Key: InChIKey=IGHJAWFSPCPFFM-UHFFFAOYSA-N
Data: 1 Kd
Activity Spreadsheet -- Enzyme Inhibition Constant Data from BindingDB
Found 1 hit for monomerid = 50078222
Trg + Lig
Ki
nM
ΔG°
kcal/mole
IC50
nM
Kd
nM
EC50/IC50
nM
koff
s-1
kon
M-1s-1
pHTemp
°C
RAC-alpha serine/threonine-protein kinase
(Homo sapiens (Human))
BDBM50078222
(CHEMBL3414673)
Show SMILES CC(C)CCCC1(C)CCc2cc(O)ccc2O1
Show InChI InChI=1S/C16H24O2/c1-12(2)5-4-9-16(3)10-8-13-11-14(17)6-7-15(13)18-16/h6-7,11-12,17H,4-5,8-10H2,1-3H3
n/an/an/a 350n/an/an/an/an/a
The Ohio State University
Curated by ChEMBL
Assay Description
Binding affinity to GST-tagged PH domain of AKT (unknown origin) by surface Plasmon resonance spectroscopy
J Med Chem 58: 2290-8 (2015)
Article DOI: 10.1021/jm501751b
BindingDB Entry DOI: 10.7270/Q20V8FGX