BDBM50078322 CHEMBL3414710
SMILES: [H][C@]12CSC(N)=N[C@]1(CO[C@H](C2)C1CC1)c1ccc(F)cc1F
InChI Key: InChIKey=RHJJDGACVHKXNA-JJMVLAAESA-N
Data: 4 IC50
Activity Spreadsheet -- Enzyme Inhibition Constant Data from BindingDB
Found 4 hits for monomerid = 50078322
Trg + Lig
Ki
nM
ΔG°
kcal/mole
IC50
nM
Kd
nM
EC50/IC50
nM
koff
s-1
kon
M-1s-1
pHTemp
°C
Beta-secretase 1
(Homo sapiens (Human))
BDBM50078322
(CHEMBL3414710)
Show SMILES [H][C@]12CSC(N)=N[C@]1(CO[C@H](C2)C1CC1)c1ccc(F)cc1F |r,c:5|
Show InChI InChI=1S/C16H18F2N2OS/c17-11-3-4-12(13(18)6-11)16-8-21-14(9-1-2-9)5-10(16)7-22-15(19)20-16/h3-4,6,9-10,14H,1-2,5,7-8H2,(H2,19,20)/t10-,14+,16-/m0/s1
n/an/a 24n/an/an/an/an/an/a
Eurofarma Laboratorios S.A.
Curated by ChEMBL
Assay Description
Inhibition of BACE1 in human H4 cells overexpressing APP695 assessed as sAPPbeta level after 18 hrs by ELISA
J Med Chem 58: 2678-702 (2015)
Article DOI: 10.1021/jm501833t
BindingDB Entry DOI: 10.7270/Q2W37Z1D
Cytochrome P450 2D6
(Homo sapiens (Human))
BDBM50078322
(CHEMBL3414710)
Show SMILES [H][C@]12CSC(N)=N[C@]1(CO[C@H](C2)C1CC1)c1ccc(F)cc1F |r,c:5|
Show InChI InChI=1S/C16H18F2N2OS/c17-11-3-4-12(13(18)6-11)16-8-21-14(9-1-2-9)5-10(16)7-22-15(19)20-16/h3-4,6,9-10,14H,1-2,5,7-8H2,(H2,19,20)/t10-,14+,16-/m0/s1
n/an/a 1.40E+3n/an/an/an/an/an/a
Eurofarma Laboratorios S.A.
Curated by ChEMBL
Assay Description
Inhibition of CYP2D6 (unknown origin)
J Med Chem 58: 2678-702 (2015)
Article DOI: 10.1021/jm501833t
BindingDB Entry DOI: 10.7270/Q2W37Z1D
Beta-secretase 1
(Homo sapiens (Human))
BDBM50078322
(CHEMBL3414710)
Show SMILES [H][C@]12CSC(N)=N[C@]1(CO[C@H](C2)C1CC1)c1ccc(F)cc1F |r,c:5|
Show InChI InChI=1S/C16H18F2N2OS/c17-11-3-4-12(13(18)6-11)16-8-21-14(9-1-2-9)5-10(16)7-22-15(19)20-16/h3-4,6,9-10,14H,1-2,5,7-8H2,(H2,19,20)/t10-,14+,16-/m0/s1
n/an/a 280n/an/an/an/an/an/a
Eurofarma Laboratorios S.A.
Curated by ChEMBL
Assay Description
Inhibition of BACE1 (unknown origin) using biotin-GLTNIKTEEISEISYEVEFR-C[Oregon Green]KK-OH as substrate after 3 hrs by fluorescence polarization ass...
J Med Chem 58: 2678-702 (2015)
Article DOI: 10.1021/jm501833t
BindingDB Entry DOI: 10.7270/Q2W37Z1D
Cathepsin D
(Homo sapiens (Human))
BDBM50078322
(CHEMBL3414710)
Show SMILES [H][C@]12CSC(N)=N[C@]1(CO[C@H](C2)C1CC1)c1ccc(F)cc1F |r,c:5|
Show InChI InChI=1S/C16H18F2N2OS/c17-11-3-4-12(13(18)6-11)16-8-21-14(9-1-2-9)5-10(16)7-22-15(19)20-16/h3-4,6,9-10,14H,1-2,5,7-8H2,(H2,19,20)/t10-,14+,16-/m0/s1
NCI pathway
Reactome pathway
n/an/a 4.50E+4n/an/an/an/an/an/a
Eurofarma Laboratorios S.A.
Curated by ChEMBL
Assay Description
Inhibition of CatD (unknown origin) by fluorescence polarization assay
J Med Chem 58: 2678-702 (2015)
Article DOI: 10.1021/jm501833t
BindingDB Entry DOI: 10.7270/Q2W37Z1D