BDBM50078386 CHEMBL3414913
SMILES: COc1cnc2ccc(cc2c1)C(F)(F)c1nnc2c(F)cc(cn12)-c1cc(C)no1
InChI Key: InChIKey=WTKKFHIXNHMTGS-UHFFFAOYSA-N
Data: 2 IC50
Activity Spreadsheet -- Enzyme Inhibition Constant Data from BindingDB
Found 2 hits for monomerid = 50078386
Trg + Lig
Ki
nM
ΔG°
kcal/mole
IC50
nM
Kd
nM
EC50/IC50
nM
koff
s-1
kon
M-1s-1
pHTemp
°C
Hepatocyte growth factor receptor
(Homo sapiens (Human))
BDBM50078386
(CHEMBL3414913)
Show SMILES COc1cnc2ccc(cc2c1)C(F)(F)c1nnc2c(F)cc(cn12)-c1cc(C)no1
Show InChI InChI=1S/C21H14F3N5O2/c1-11-5-18(31-28-11)13-8-16(22)19-26-27-20(29(19)10-13)21(23,24)14-3-4-17-12(6-14)7-15(30-2)9-25-17/h3-10H,1-2H3
n/an/a 3n/an/an/an/an/an/a
Amgen Inc.
Curated by ChEMBL
Assay Description
Inhibition of recombinant c-Met kinase domain (unknown origin) incubated for 30 mins using gastrin peptide substrate by HTRF assay
J Med Chem 58: 2417-30 (2015)
Article DOI: 10.1021/jm501913a
BindingDB Entry DOI: 10.7270/Q2MP5502
Hepatocyte growth factor receptor
(Homo sapiens (Human))
BDBM50078386
(CHEMBL3414913)
Show SMILES COc1cnc2ccc(cc2c1)C(F)(F)c1nnc2c(F)cc(cn12)-c1cc(C)no1
Show InChI InChI=1S/C21H14F3N5O2/c1-11-5-18(31-28-11)13-8-16(22)19-26-27-20(29(19)10-13)21(23,24)14-3-4-17-12(6-14)7-15(30-2)9-25-17/h3-10H,1-2H3
n/an/a 8n/an/an/an/an/an/a
Amgen Inc.
Curated by ChEMBL
Assay Description
Inhibition of HGF-stimulated c-Met autophosphorylation in serum starved human PC3 cells pre-incubated for 1 hr followed by human recombinant HGF stim...
J Med Chem 58: 2417-30 (2015)
Article DOI: 10.1021/jm501913a
BindingDB Entry DOI: 10.7270/Q2MP5502