null
SMILES: O=c1[nH]ccc2cc(Nc3n[nH]c4cccnc34)ccc12
InChI Key: InChIKey=VAUVMLDUCKXMEV-UHFFFAOYSA-N
Activity Spreadsheet -- Enzyme Inhibition Constant Data from BindingDB
Found 4 hits for monomerid = 50078637
Trg + Lig
Ki
nM
ΔG°
kcal/mole
IC50
nM
Kd
nM
EC50/IC50
nM
koff
s-1
kon
M-1s-1
pHTemp
°C
Metabotropic glutamate receptor 4
(Homo sapiens (Human))
BDBM50078637
(CHEMBL4784617)
Show SMILES O=c1[nH]ccc2cc(Nc3n[nH]c4cccnc34)ccc12
Show InChI InChI=1S/C15H13N5/c1-19-10-17-14(13-8-18-20(2)9-13)15(19)12-5-3-11(7-16)4-6-12/h3-6,8-10H,1-2H3
n/an/an/an/a 264n/an/an/an/a
TBA
Assay Description
Inhibition of human urine urokinase using L-PyroGlu-Gly-Arg-pNA.HCl substrate at 5 uM
Citation and Details
Cytochrome P450 3A4
(Homo sapiens (Human))
BDBM50078637
(CHEMBL4784617)
Show SMILES O=c1[nH]ccc2cc(Nc3n[nH]c4cccnc34)ccc12
Show InChI InChI=1S/C15H13N5/c1-19-10-17-14(13-8-18-20(2)9-13)15(19)12-5-3-11(7-16)4-6-12/h3-6,8-10H,1-2H3
Reactome pathway
n/an/a>3.00E+4n/an/an/an/an/an/a
TBA
Assay Description
Inhibition of human urine urokinase using L-PyroGlu-Gly-Arg-pNA.HCl substrate at 5 uM
Citation and Details
Cytochrome P450 2C9
(Homo sapiens (Human))
BDBM50078637
(CHEMBL4784617)
Show SMILES O=c1[nH]ccc2cc(Nc3n[nH]c4cccnc34)ccc12
Show InChI InChI=1S/C15H13N5/c1-19-10-17-14(13-8-18-20(2)9-13)15(19)12-5-3-11(7-16)4-6-12/h3-6,8-10H,1-2H3
Reactome pathway
n/an/a>3.00E+4n/an/an/an/an/an/a
TBA
Assay Description
Inhibition of human urine urokinase using L-PyroGlu-Gly-Arg-pNA.HCl substrate at 5 uM
Citation and Details
Cytochrome P450 1A2
(Homo sapiens (Human))
BDBM50078637
(CHEMBL4784617)
Show SMILES O=c1[nH]ccc2cc(Nc3n[nH]c4cccnc34)ccc12
Show InChI InChI=1S/C15H13N5/c1-19-10-17-14(13-8-18-20(2)9-13)15(19)12-5-3-11(7-16)4-6-12/h3-6,8-10H,1-2H3
Reactome pathway
n/an/a 3.30E+3n/an/an/an/an/an/a
TBA
Assay Description
Inhibition of human plasmin using pyroGlu-Phe-Lys-pNA.HCl
Citation and Details