BDBM50078639 CHEMBL3415181
SMILES: Cc1cn(CCn2cncc2-c2ccc(cc2)C#N)nn1
InChI Key: InChIKey=LYXPBOVOLCOITB-UHFFFAOYSA-N
Data: 2 IC50
Activity Spreadsheet -- Enzyme Inhibition Constant Data from BindingDB
Found 1 hit for monomerid = 50078639
Trg + Lig
Ki
nM
ΔG°
kcal/mole
IC50
nM
Kd
nM
EC50/IC50
nM
koff
s-1
kon
M-1s-1
pHTemp
°C
Metabotropic glutamate receptor 4
(Homo sapiens (Human))
BDBM50078639
(CHEMBL4762098)
Show SMILES Cc1cn(CCn2cncc2-c2ccc(cc2)C#N)nn1
Show InChI InChI=1S/C15H14N6/c1-12-10-21(19-18-12)7-6-20-11-17-9-15(20)14-4-2-13(8-16)3-5-14/h2-5,9-11H,6-7H2,1H3
n/an/an/an/a 685n/an/an/an/a
TBA
Assay Description
Inhibition of human urine urokinase using L-PyroGlu-Gly-Arg-pNA.HCl substrate at 5 uM
Citation and Details