BDBM50079350 CHEMBL3416806
SMILES: CCNC(=O)[C@H]1O[C@H]([C@H](O)[C@@H]1O)n1cnc2c(N)nc(nc12)N1CCN(CC1)c1ccc(OCc2ccc(Cl)cc2)cc1
InChI Key: InChIKey=MUNVDVWWEQGHID-NLJXWPIHSA-N
Data: 3 KI  2 EC50
Activity Spreadsheet -- Enzyme Inhibition Constant Data from BindingDB
Found 5 hits for monomerid = 50079350
Trg + Lig
Ki
nM
ΔG°
kcal/mole
IC50
nM
Kd
nM
EC50/IC50
nM
koff
s-1
kon
M-1s-1
pHTemp
°C
Adenosine receptor A1
(Homo sapiens (Human))
BDBM50079350
(CHEMBL3416806)
Show SMILES CCNC(=O)[C@H]1O[C@H]([C@H](O)[C@@H]1O)n1cnc2c(N)nc(nc12)N1CCN(CC1)c1ccc(OCc2ccc(Cl)cc2)cc1 |r|
Show InChI InChI=1S/C29H33ClN8O5/c1-2-32-27(41)24-22(39)23(40)28(43-24)38-16-33-21-25(31)34-29(35-26(21)38)37-13-11-36(12-14-37)19-7-9-20(10-8-19)42-15-17-3-5-18(30)6-4-17/h3-10,16,22-24,28,39-40H,2,11-15H2,1H3,(H,32,41)(H2,31,34,35)/t22-,23+,24-,28+/m0/s1
Reactome pathway
8.10n/an/an/an/an/an/an/an/a
Universit£ degli Studi di Ferrara
Curated by ChEMBL
Assay Description
Displacement of [3H]CCPA from human adenosine A1 receptor expressed in CHO cell membranes incubated for 120 mins by scintillation counting method
J Med Chem 58: 3253-67 (2015)
Article DOI: 10.1021/acs.jmedchem.5b00215
BindingDB Entry DOI: 10.7270/Q2X068RF
Adenosine receptor A2a
(Homo sapiens (Human))
BDBM50079350
(CHEMBL3416806)
Show SMILES CCNC(=O)[C@H]1O[C@H]([C@H](O)[C@@H]1O)n1cnc2c(N)nc(nc12)N1CCN(CC1)c1ccc(OCc2ccc(Cl)cc2)cc1 |r|
Show InChI InChI=1S/C29H33ClN8O5/c1-2-32-27(41)24-22(39)23(40)28(43-24)38-16-33-21-25(31)34-29(35-26(21)38)37-13-11-36(12-14-37)19-7-9-20(10-8-19)42-15-17-3-5-18(30)6-4-17/h3-10,16,22-24,28,39-40H,2,11-15H2,1H3,(H,32,41)(H2,31,34,35)/t22-,23+,24-,28+/m0/s1
NCI pathway
Reactome pathway
33n/an/an/an/an/an/an/an/a
Universit£ degli Studi di Ferrara
Curated by ChEMBL
Assay Description
Displacement of [3H]CGS21680 from human adenosine A2A receptor expressed in CHO cell membranes incubated for 120 mins by scintillation counting metho...
J Med Chem 58: 3253-67 (2015)
Article DOI: 10.1021/acs.jmedchem.5b00215
BindingDB Entry DOI: 10.7270/Q2X068RF
Adenosine receptor A3
(Homo sapiens (Human))
BDBM50079350
(CHEMBL3416806)
Show SMILES CCNC(=O)[C@H]1O[C@H]([C@H](O)[C@@H]1O)n1cnc2c(N)nc(nc12)N1CCN(CC1)c1ccc(OCc2ccc(Cl)cc2)cc1 |r|
Show InChI InChI=1S/C29H33ClN8O5/c1-2-32-27(41)24-22(39)23(40)28(43-24)38-16-33-21-25(31)34-29(35-26(21)38)37-13-11-36(12-14-37)19-7-9-20(10-8-19)42-15-17-3-5-18(30)6-4-17/h3-10,16,22-24,28,39-40H,2,11-15H2,1H3,(H,32,41)(H2,31,34,35)/t22-,23+,24-,28+/m0/s1
Reactome pathway
36n/an/an/an/an/an/an/an/a
Universit£ degli Studi di Ferrara
Curated by ChEMBL
Assay Description
Displacement of [3H]AB-MECA from human adenosine A3 receptor expressed in CHO cell membranes incubated for 30 mins by scintillation counting method
J Med Chem 58: 3253-67 (2015)
Article DOI: 10.1021/acs.jmedchem.5b00215
BindingDB Entry DOI: 10.7270/Q2X068RF
Adenosine receptor A2b
(Homo sapiens (Human))
BDBM50079350
(CHEMBL3416806)
Show SMILES CCNC(=O)[C@H]1O[C@H]([C@H](O)[C@@H]1O)n1cnc2c(N)nc(nc12)N1CCN(CC1)c1ccc(OCc2ccc(Cl)cc2)cc1 |r|
Show InChI InChI=1S/C29H33ClN8O5/c1-2-32-27(41)24-22(39)23(40)28(43-24)38-16-33-21-25(31)34-29(35-26(21)38)37-13-11-36(12-14-37)19-7-9-20(10-8-19)42-15-17-3-5-18(30)6-4-17/h3-10,16,22-24,28,39-40H,2,11-15H2,1H3,(H,32,41)(H2,31,34,35)/t22-,23+,24-,28+/m0/s1
NCI pathway
Reactome pathway
n/an/an/an/a 927n/an/an/an/a
Universit£ degli Studi di Ferrara
Curated by ChEMBL
Assay Description
Agonist activity at human adenosine A2B receptor expressed in CHO cells assessed as stimulation of [3H]cAMP levels by scintillation counting method
J Med Chem 58: 3253-67 (2015)
Article DOI: 10.1021/acs.jmedchem.5b00215
BindingDB Entry DOI: 10.7270/Q2X068RF
Adenosine receptor A2a
(Homo sapiens (Human))
BDBM50079350
(CHEMBL3416806)
Show SMILES CCNC(=O)[C@H]1O[C@H]([C@H](O)[C@@H]1O)n1cnc2c(N)nc(nc12)N1CCN(CC1)c1ccc(OCc2ccc(Cl)cc2)cc1 |r|
Show InChI InChI=1S/C29H33ClN8O5/c1-2-32-27(41)24-22(39)23(40)28(43-24)38-16-33-21-25(31)34-29(35-26(21)38)37-13-11-36(12-14-37)19-7-9-20(10-8-19)42-15-17-3-5-18(30)6-4-17/h3-10,16,22-24,28,39-40H,2,11-15H2,1H3,(H,32,41)(H2,31,34,35)/t22-,23+,24-,28+/m0/s1
NCI pathway
Reactome pathway
n/an/an/an/a 52n/an/an/an/a
Universit£ degli Studi di Ferrara
Curated by ChEMBL
Assay Description
Agonist activity at human adenosine A2A receptor expressed in CHO cells assessed as stimulation of [3H]cAMP levels by scintillation counting method
J Med Chem 58: 3253-67 (2015)
Article DOI: 10.1021/acs.jmedchem.5b00215
BindingDB Entry DOI: 10.7270/Q2X068RF