BDBM50079360 CHEBI:69681::DICHAMANETIN::Dichamanetin
SMILES: Oc1ccccc1Cc1c(O)c(Cc2ccccc2O)c2O[C@@H](CC(=O)c2c1O)c1ccccc1
InChI Key: InChIKey=WBZSDBHJYZORRP-VWLOTQADSA-N
Data: 1 IC50
Activity Spreadsheet -- Enzyme Inhibition Constant Data from BindingDB
Found 1 hit for monomerid = 50079360
Trg + Lig
Ki
nM
ΔG°
kcal/mole
IC50
nM
Kd
nM
EC50/IC50
nM
koff
s-1
kon
M-1s-1
pHTemp
°C
Cell division protein FtsZ
(Escherichia coli)
BDBM50079360
(CHEBI:69681 | DICHAMANETIN | Dichamanetin)
Show SMILES Oc1ccccc1Cc1c(O)c(Cc2ccccc2O)c2O[C@@H](CC(=O)c2c1O)c1ccccc1 |r|
Show InChI InChI=1S/C29H24O6/c30-22-12-6-4-10-18(22)14-20-27(33)21(15-19-11-5-7-13-23(19)31)29-26(28(20)34)24(32)16-25(35-29)17-8-2-1-3-9-17/h1-13,25,30-31,33-34H,14-16H2/t25-/m0/s1
n/an/a 1.25E+4n/an/an/an/an/an/a
Shandong University
Curated by ChEMBL
Assay Description
Inhibition of Escherichia coli FtsZ GTPase activity
Eur J Med Chem 95: 1-15 (2015)
Article DOI: 10.1016/j.ejmech.2015.03.026
BindingDB Entry DOI: 10.7270/Q2S75J14