BDBM50079444 CHEMBL317887::[(2R,5R,8R,11S)-5-Benzyl-11-(3-guanidino-propyl)-8-isopropyl-3,6,9,12,15-pentaoxo-1,4,7,10,13pentaaza-cyclopentadec-2-yl]-acetic acid; TFA
SMILES: CC(C)[C@H]1NC(=O)[C@@H](Cc2ccccc2)NC(=O)[C@@H](CC(O)=O)NC(=O)CNC(=O)[C@H](CCCNC(N)=N)NC1=O
InChI Key: InChIKey=YYQUWEHEBOMRPH-XKGFGPFHSA-N
Data: 2 IC50
Activity Spreadsheet -- Enzyme Inhibition Constant Data from BindingDB
Found 2 hits for monomerid = 50079444
Trg + Lig
Ki
nM
ΔG°
kcal/mole
IC50
nM
Kd
nM
EC50/IC50
nM
koff
s-1
kon
M-1s-1
pHTemp
°C
Integrin alpha-IIb/beta-3
(Homo sapiens (Human))
BDBM50079444
(CHEMBL317887 | [(2R,5R,8R,11S)-5-Benzyl-11-(3-guan...)
Show SMILES CC(C)[C@H]1NC(=O)[C@@H](Cc2ccccc2)NC(=O)[C@@H](CC(O)=O)NC(=O)CNC(=O)[C@H](CCCNC(N)=N)NC1=O
Show InChI InChI=1S/C26H38N8O7/c1-14(2)21-25(41)32-16(9-6-10-29-26(27)28)22(38)30-13-19(35)31-18(12-20(36)37)23(39)33-17(24(40)34-21)11-15-7-4-3-5-8-15/h3-5,7-8,14,16-18,21H,6,9-13H2,1-2H3,(H,30,38)(H,31,35)(H,32,41)(H,33,39)(H,34,40)(H,36,37)(H4,27,28,29)/t16-,17+,18+,21+/m0/s1
n/an/a 1.70E+3n/an/an/an/an/an/a
Technische Universität München
Curated by ChEMBL
Assay Description
Inhibition of alpha IIb beta3 integrin binding to fibrinogen
J Med Chem 42: 3033-40 (1999)
Article DOI: 10.1021/jm970832g
BindingDB Entry DOI: 10.7270/Q2CN733T
ITGAV/ITGB3
(Homo sapiens (Human))
BDBM50079444
(CHEMBL317887 | [(2R,5R,8R,11S)-5-Benzyl-11-(3-guan...)
Show SMILES CC(C)[C@H]1NC(=O)[C@@H](Cc2ccccc2)NC(=O)[C@@H](CC(O)=O)NC(=O)CNC(=O)[C@H](CCCNC(N)=N)NC1=O
Show InChI InChI=1S/C26H38N8O7/c1-14(2)21-25(41)32-16(9-6-10-29-26(27)28)22(38)30-13-19(35)31-18(12-20(36)37)23(39)33-17(24(40)34-21)11-15-7-4-3-5-8-15/h3-5,7-8,14,16-18,21H,6,9-13H2,1-2H3,(H,30,38)(H,31,35)(H,32,41)(H,33,39)(H,34,40)(H,36,37)(H4,27,28,29)/t16-,17+,18+,21+/m0/s1
n/an/a 2.5n/an/an/an/an/an/a
Technische Universität München
Curated by ChEMBL
Assay Description
Inhibition of Vitronectin receptor (alpha V beta 3) binding to fibrinogen
J Med Chem 42: 3033-40 (1999)
Article DOI: 10.1021/jm970832g
BindingDB Entry DOI: 10.7270/Q2CN733T