null
SMILES: CC\C(=C(\c1ccc(OCC(O)=O)cc1)c1cccc(O)c1)c1ccccc1
InChI Key: InChIKey=CAPHKVMHGPLJRK-ZNTNEXAZSA-N
Activity Spreadsheet -- Enzyme Inhibition Constant Data from BindingDB
Found 1 hit for monomerid = 50079492
Trg + Lig
Ki
nM
ΔG°
kcal/mole
IC50
nM
Kd
nM
EC50/IC50
nM
koff
s-1
kon
M-1s-1
pHTemp
°C
Estrogen receptor
(Homo sapiens (Human))
BDBM50079492
(CHEMBL104416 | {4-[(E)-1-(3-Hydroxy-phenyl)-2-phen...)
Show SMILES CC\C(=C(\c1ccc(OCC(O)=O)cc1)c1cccc(O)c1)c1ccccc1
Show InChI InChI=1S/C24H22O4/c1-2-22(17-7-4-3-5-8-17)24(19-9-6-10-20(25)15-19)18-11-13-21(14-12-18)28-16-23(26)27/h3-15,25H,2,16H2,1H3,(H,26,27)/b24-22+
n/an/a 1.44E+3n/an/an/an/an/an/a
University of Georgia
Curated by ChEMBL
Assay Description
Displacement of [3H]-17-beta-estradiol from human estrogen receptor alpha
J Med Chem 42: 3126-33 (1999)
Article DOI: 10.1021/jm990078u
BindingDB Entry DOI: 10.7270/Q2QZ296Z