BDBM50079496 CHEMBL3417209
SMILES: COc1cc2CC[C@H](NC(=O)c3ccc(cc3)C(=O)Nc3ccccc3N)c3cc(=O)c(OC)ccc3-c2c(OC)c1OC
InChI Key: InChIKey=HWTSSMIDLURKPL-VWLOTQADSA-N
Data: 3 IC50
Activity Spreadsheet -- Enzyme Inhibition Constant Data from BindingDB
Found 3 hits for monomerid = 50079496
Trg + Lig
Ki
nM
ΔG°
kcal/mole
IC50
nM
Kd
nM
EC50/IC50
nM
koff
s-1
kon
M-1s-1
pHTemp
°C
Histone deacetylase 1
(Homo sapiens (Human))
BDBM50079496
(CHEMBL3417209)
Show SMILES COc1cc2CC[C@H](NC(=O)c3ccc(cc3)C(=O)Nc3ccccc3N)c3cc(=O)c(OC)ccc3-c2c(OC)c1OC |r|
Show InChI InChI=1S/C34H33N3O7/c1-41-28-16-14-22-23(18-27(28)38)25(15-13-21-17-29(42-2)31(43-3)32(44-4)30(21)22)36-33(39)19-9-11-20(12-10-19)34(40)37-26-8-6-5-7-24(26)35/h5-12,14,16-18,25H,13,15,35H2,1-4H3,(H,36,39)(H,37,40)/t25-/m0/s1
NCI pathway
Reactome pathway
n/an/a 1.59E+4n/an/an/an/an/an/a
East China Normal University
Curated by ChEMBL
Assay Description
Inhibition of recombinant human HDAC1 expressed in baculovirus infected insect High5 cells using Ac-Lys-Tyr-Lys (epsilon-acetyl)-AMC as substrate aft...
Eur J Med Chem 95: 127-35 (2015)
Article DOI: 10.1016/j.ejmech.2015.03.035
BindingDB Entry DOI: 10.7270/Q24J0GVC
Histone deacetylase 3
(Homo sapiens (Human))
BDBM50079496
(CHEMBL3417209)
Show SMILES COc1cc2CC[C@H](NC(=O)c3ccc(cc3)C(=O)Nc3ccccc3N)c3cc(=O)c(OC)ccc3-c2c(OC)c1OC |r|
Show InChI InChI=1S/C34H33N3O7/c1-41-28-16-14-22-23(18-27(28)38)25(15-13-21-17-29(42-2)31(43-3)32(44-4)30(21)22)36-33(39)19-9-11-20(12-10-19)34(40)37-26-8-6-5-7-24(26)35/h5-12,14,16-18,25H,13,15,35H2,1-4H3,(H,36,39)(H,37,40)/t25-/m0/s1
NCI pathway
Reactome pathway
n/an/a 1.21E+4n/an/an/an/an/an/a
East China Normal University
Curated by ChEMBL
Assay Description
Inhibition of recombinant human HDAC3 expressed in baculovirus infected insect High5 cells using Ac-Lys-Tyr-Lys (epsilon-acetyl)-AMC as substrate aft...
Eur J Med Chem 95: 127-35 (2015)
Article DOI: 10.1016/j.ejmech.2015.03.035
BindingDB Entry DOI: 10.7270/Q24J0GVC
Histone deacetylase 2
(Homo sapiens (Human))
BDBM50079496
(CHEMBL3417209)
Show SMILES COc1cc2CC[C@H](NC(=O)c3ccc(cc3)C(=O)Nc3ccccc3N)c3cc(=O)c(OC)ccc3-c2c(OC)c1OC |r|
Show InChI InChI=1S/C34H33N3O7/c1-41-28-16-14-22-23(18-27(28)38)25(15-13-21-17-29(42-2)31(43-3)32(44-4)30(21)22)36-33(39)19-9-11-20(12-10-19)34(40)37-26-8-6-5-7-24(26)35/h5-12,14,16-18,25H,13,15,35H2,1-4H3,(H,36,39)(H,37,40)/t25-/m0/s1
NCI pathway
Reactome pathway
n/an/a 1.04E+4n/an/an/an/an/an/a
East China Normal University
Curated by ChEMBL
Assay Description
Inhibition of recombinant human HDAC2 expressed in baculovirus infected insect High5 cells using Ac-Lys-Tyr-Lys (epsilon-acetyl)-AMC as substrate aft...
Eur J Med Chem 95: 127-35 (2015)
Article DOI: 10.1016/j.ejmech.2015.03.035
BindingDB Entry DOI: 10.7270/Q24J0GVC