BDBM50079497 CHEMBL3417210
SMILES: COc1cc2CC[C@H](NC(=O)c3ccc(cc3)C(=O)Nc3cc(ccc3N)-c3cccs3)c3cc(=O)c(OC)ccc3-c2c(OC)c1OC
InChI Key: InChIKey=ZJQWHJDXKHHLEP-NDEPHWFRSA-N
Data: 3 IC50
Activity Spreadsheet -- Enzyme Inhibition Constant Data from BindingDB
Found 3 hits for monomerid = 50079497
Trg + Lig
Ki
nM
ΔG°
kcal/mole
IC50
nM
Kd
nM
EC50/IC50
nM
koff
s-1
kon
M-1s-1
pHTemp
°C
Histone deacetylase 1
(Homo sapiens (Human))
BDBM50079497
(CHEMBL3417210)
Show SMILES COc1cc2CC[C@H](NC(=O)c3ccc(cc3)C(=O)Nc3cc(ccc3N)-c3cccs3)c3cc(=O)c(OC)ccc3-c2c(OC)c1OC |r|
Show InChI InChI=1S/C38H35N3O7S/c1-45-31-16-13-25-26(20-30(31)42)28(15-12-24-19-32(46-2)35(47-3)36(48-4)34(24)25)40-37(43)21-7-9-22(10-8-21)38(44)41-29-18-23(11-14-27(29)39)33-6-5-17-49-33/h5-11,13-14,16-20,28H,12,15,39H2,1-4H3,(H,40,43)(H,41,44)/t28-/m0/s1
NCI pathway
Reactome pathway
n/an/a 2.24E+3n/an/an/an/an/an/a
East China Normal University
Curated by ChEMBL
Assay Description
Inhibition of recombinant human HDAC1 expressed in baculovirus infected insect High5 cells using Ac-Lys-Tyr-Lys (epsilon-acetyl)-AMC as substrate aft...
Eur J Med Chem 95: 127-35 (2015)
Article DOI: 10.1016/j.ejmech.2015.03.035
BindingDB Entry DOI: 10.7270/Q24J0GVC
Histone deacetylase 3
(Homo sapiens (Human))
BDBM50079497
(CHEMBL3417210)
Show SMILES COc1cc2CC[C@H](NC(=O)c3ccc(cc3)C(=O)Nc3cc(ccc3N)-c3cccs3)c3cc(=O)c(OC)ccc3-c2c(OC)c1OC |r|
Show InChI InChI=1S/C38H35N3O7S/c1-45-31-16-13-25-26(20-30(31)42)28(15-12-24-19-32(46-2)35(47-3)36(48-4)34(24)25)40-37(43)21-7-9-22(10-8-21)38(44)41-29-18-23(11-14-27(29)39)33-6-5-17-49-33/h5-11,13-14,16-20,28H,12,15,39H2,1-4H3,(H,40,43)(H,41,44)/t28-/m0/s1
NCI pathway
Reactome pathway
n/an/a 1.97E+3n/an/an/an/an/an/a
East China Normal University
Curated by ChEMBL
Assay Description
Inhibition of recombinant human HDAC3 expressed in baculovirus infected insect High5 cells using Ac-Lys-Tyr-Lys (epsilon-acetyl)-AMC as substrate aft...
Eur J Med Chem 95: 127-35 (2015)
Article DOI: 10.1016/j.ejmech.2015.03.035
BindingDB Entry DOI: 10.7270/Q24J0GVC
Histone deacetylase 2
(Homo sapiens (Human))
BDBM50079497
(CHEMBL3417210)
Show SMILES COc1cc2CC[C@H](NC(=O)c3ccc(cc3)C(=O)Nc3cc(ccc3N)-c3cccs3)c3cc(=O)c(OC)ccc3-c2c(OC)c1OC |r|
Show InChI InChI=1S/C38H35N3O7S/c1-45-31-16-13-25-26(20-30(31)42)28(15-12-24-19-32(46-2)35(47-3)36(48-4)34(24)25)40-37(43)21-7-9-22(10-8-21)38(44)41-29-18-23(11-14-27(29)39)33-6-5-17-49-33/h5-11,13-14,16-20,28H,12,15,39H2,1-4H3,(H,40,43)(H,41,44)/t28-/m0/s1
NCI pathway
Reactome pathway
n/an/a 380n/an/an/an/an/an/a
East China Normal University
Curated by ChEMBL
Assay Description
Inhibition of recombinant human HDAC2 expressed in baculovirus infected insect High5 cells using Ac-Lys-Tyr-Lys (epsilon-acetyl)-AMC as substrate aft...
Eur J Med Chem 95: 127-35 (2015)
Article DOI: 10.1016/j.ejmech.2015.03.035
BindingDB Entry DOI: 10.7270/Q24J0GVC