BDBM50079549 CHEMBL3417473
SMILES: CN(C)CCOC(=O)Nc1cccc(Cn2nc(ccc2=O)-n2ccc3ccc(F)cc23)c1
InChI Key: InChIKey=XLJBJJAZSWASNW-UHFFFAOYSA-N
Data: 1 IC50
Activity Spreadsheet -- Enzyme Inhibition Constant Data from BindingDB
Found 1 hit for monomerid = 50079549
Trg + Lig
Ki
nM
ΔG°
kcal/mole
IC50
nM
Kd
nM
EC50/IC50
nM
koff
s-1
kon
M-1s-1
pHTemp
°C
Hepatocyte growth factor receptor
(Homo sapiens (Human))
BDBM50079549
(CHEMBL3417473)
Show SMILES CN(C)CCOC(=O)Nc1cccc(Cn2nc(ccc2=O)-n2ccc3ccc(F)cc23)c1
Show InChI InChI=1S/C24H24FN5O3/c1-28(2)12-13-33-24(32)26-20-5-3-4-17(14-20)16-30-23(31)9-8-22(27-30)29-11-10-18-6-7-19(25)15-21(18)29/h3-11,14-15H,12-13,16H2,1-2H3,(H,26,32)
n/an/a 191n/an/an/an/an/an/a
Chinese Academy of Sciences
Curated by ChEMBL
Assay Description
Inhibition of recombinant c-Met (unknown origin) using poly (Glu,Tyr)4:1 substrate incubated for 60 mins by ELISA method
Eur J Med Chem 95: 302-12 (2015)
Article DOI: 10.1016/j.ejmech.2015.03.041
BindingDB Entry DOI: 10.7270/Q2GQ70G4