BDBM50079560 CHEMBL3417484
SMILES: Fc1ccc2ccn(-c3ccc(=O)n(Cc4cccc(c4)-c4ncc(OCCN5CCOCC5)cn4)n3)c2c1
InChI Key: InChIKey=VAPYMSUWZDXTGJ-UHFFFAOYSA-N
Data: 1 IC50
Activity Spreadsheet -- Enzyme Inhibition Constant Data from BindingDB
Found 1 hit for monomerid = 50079560
Trg + Lig
Ki
nM
ΔG°
kcal/mole
IC50
nM
Kd
nM
EC50/IC50
nM
koff
s-1
kon
M-1s-1
pHTemp
°C
Hepatocyte growth factor receptor
(Homo sapiens (Human))
BDBM50079560
(CHEMBL3417484)
Show SMILES Fc1ccc2ccn(-c3ccc(=O)n(Cc4cccc(c4)-c4ncc(OCCN5CCOCC5)cn4)n3)c2c1
Show InChI InChI=1S/C29H27FN6O3/c30-24-5-4-22-8-9-35(26(22)17-24)27-6-7-28(37)36(33-27)20-21-2-1-3-23(16-21)29-31-18-25(19-32-29)39-15-12-34-10-13-38-14-11-34/h1-9,16-19H,10-15,20H2
n/an/a 2.30n/an/an/an/an/an/a
Chinese Academy of Sciences
Curated by ChEMBL
Assay Description
Inhibition of recombinant c-Met (unknown origin) using poly (Glu,Tyr)4:1 substrate incubated for 60 mins by ELISA method
Eur J Med Chem 95: 302-12 (2015)
Article DOI: 10.1016/j.ejmech.2015.03.041
BindingDB Entry DOI: 10.7270/Q2GQ70G4