null
SMILES: CCC(C)[C@@H](CN(CC(=O)N[C@@H](CCSC)C(O)=O)Cc1cccc2ccccc12)NC(=O)Cc1cncn1Cc1ccccc1
InChI Key: InChIKey=VDOIRLNHAAJVAF-AOKUBALNSA-N
Activity Spreadsheet -- Enzyme Inhibition Constant Data from BindingDB
Found 2 hits for monomerid = 50079956
Trg + Lig
Ki
nM
ΔG°
kcal/mole
IC50
nM
Kd
nM
EC50/IC50
nM
koff
s-1
kon
M-1s-1
pHTemp
°C
Geranylgeranyl transferase type-1 subunit beta/Protein farnesyltransferase/geranylgeranyltransferase type-1 subunit alpha
(Bos taurus (bovine))
BDBM50079956
((S)-2-[2-({(S)-2-[2-(3-Benzyl-3H-imidazol-4-yl)-ac...)
Show SMILES CCC(C)[C@@H](CN(CC(=O)N[C@@H](CCSC)C(O)=O)Cc1cccc2ccccc12)NC(=O)Cc1cncn1Cc1ccccc1
Show InChI InChI=1S/C36H45N5O4S/c1-4-26(2)33(39-34(42)19-30-20-37-25-41(30)21-27-11-6-5-7-12-27)23-40(24-35(43)38-32(36(44)45)17-18-46-3)22-29-15-10-14-28-13-8-9-16-31(28)29/h5-16,20,25-26,32-33H,4,17-19,21-24H2,1-3H3,(H,38,43)(H,39,42)(H,44,45)/t26?,32-,33+/m0/s1
n/an/a 8.20E+3n/an/an/an/an/an/a
Merck Research Laboratories
Curated by ChEMBL
Assay Description
Inhibition of [3H]GGPP incorporation into recombinant human Ha-RasCVLL by Geranylgeranyl transferase from bovine brain
J Med Chem 42: 3356-68 (1999)
Article DOI: 10.1021/jm990080l
BindingDB Entry DOI: 10.7270/Q27P9020
Protein farnesyltransferase subunit beta/geranylgeranyltransferase type-1 subunit alpha
(Homo sapiens (Human))
BDBM50079956
((S)-2-[2-({(S)-2-[2-(3-Benzyl-3H-imidazol-4-yl)-ac...)
Show SMILES CCC(C)[C@@H](CN(CC(=O)N[C@@H](CCSC)C(O)=O)Cc1cccc2ccccc12)NC(=O)Cc1cncn1Cc1ccccc1
Show InChI InChI=1S/C36H45N5O4S/c1-4-26(2)33(39-34(42)19-30-20-37-25-41(30)21-27-11-6-5-7-12-27)23-40(24-35(43)38-32(36(44)45)17-18-46-3)22-29-15-10-14-28-13-8-9-16-31(28)29/h5-16,20,25-26,32-33H,4,17-19,21-24H2,1-3H3,(H,38,43)(H,39,42)(H,44,45)/t26?,32-,33+/m0/s1
Reactome pathway
n/an/a 0.150n/an/an/an/an/an/a
Merck Research Laboratories
Curated by ChEMBL
Assay Description
Inhibition of [3H]FPP incorporation into recombinant [Leu68]-RAS1CVIM by Farnesyltransferase
J Med Chem 42: 3356-68 (1999)
Article DOI: 10.1021/jm990080l
BindingDB Entry DOI: 10.7270/Q27P9020