BDBM50079997 CHEMBL3415949
SMILES: [H][C@]12[C@@]3([H])[C@@]4([H])[C@@]1([H])[C@]1([H])[C@@]5([H])CN(C[C@@]5([H])[C@@]4([H])[C@@]4([H])[C@]3([H])CC[C@]2([H])[C@@]14[H])C(N)=N
InChI Key: InChIKey=XDBODLGBYWMBCF-UHFFFAOYSA-N
Data: 2 IC50
Activity Spreadsheet -- Enzyme Inhibition Constant Data from BindingDB
Found 2 hits for monomerid = 50079997
Trg + Lig
Ki
nM
ΔG°
kcal/mole
IC50
nM
Kd
nM
EC50/IC50
nM
koff
s-1
kon
M-1s-1
pHTemp
°C
Matrix protein 2
(Influenza A virus)
BDBM50079997
(CHEMBL3415949)
Show SMILES [H][C@]12[C@@]3([H])[C@@]4([H])[C@@]1([H])[C@]1([H])[C@@]5([H])CN(C[C@@]5([H])[C@@]4([H])[C@@]4([H])[C@]3([H])CC[C@]2([H])[C@@]14[H])C(N)=N |r,TLB:21:19:8:25.1,2:1:17.19.4:8,25:27:4.6:10.15,1:2:17:8.27.6,10:8:17:21.2,10:8:17.19.4:25.1,14:15:19.27:4.6,THB:12:10:19.27:4.6,21:19:4.6:10.15,23:21:17:8.27.6,2:4:8:25.1,2:4:19.27:10.15,25:27:17:21.2,24:25:17.19.4:8,1:6:17:21.2,1:6:19.27:10.15|
Show InChI InChI=1S/C17H23N3/c18-17(19)20-3-7-8(4-20)14-10-6-2-1-5-9(10)13(7)15-11(5)12(6)16(14)15/h5-16H,1-4H2,(H3,18,19)
n/an/a 3.22E+4n/an/an/an/an/an/a
Universitat de Barcelona
Curated by ChEMBL
Assay Description
Inhibition of Influenza A virus (A/udorn/1972(H3N2)) M2 V27A mutant channel expressed in Xenopus oocyte plasma membranes after 2 mins by two-electrod...
Eur J Med Chem 96: 318-29 (2015)
Article DOI: 10.1016/j.ejmech.2015.04.030
BindingDB Entry DOI: 10.7270/Q2B27X1P
Matrix protein 2
(Influenza A virus)
BDBM50079997
(CHEMBL3415949)
Show SMILES [H][C@]12[C@@]3([H])[C@@]4([H])[C@@]1([H])[C@]1([H])[C@@]5([H])CN(C[C@@]5([H])[C@@]4([H])[C@@]4([H])[C@]3([H])CC[C@]2([H])[C@@]14[H])C(N)=N |r,TLB:21:19:8:25.1,2:1:17.19.4:8,25:27:4.6:10.15,1:2:17:8.27.6,10:8:17:21.2,10:8:17.19.4:25.1,14:15:19.27:4.6,THB:12:10:19.27:4.6,21:19:4.6:10.15,23:21:17:8.27.6,2:4:8:25.1,2:4:19.27:10.15,25:27:17:21.2,24:25:17.19.4:8,1:6:17:21.2,1:6:19.27:10.15|
Show InChI InChI=1S/C17H23N3/c18-17(19)20-3-7-8(4-20)14-10-6-2-1-5-9(10)13(7)15-11(5)12(6)16(14)15/h5-16H,1-4H2,(H3,18,19)
n/an/a 3.70E+3n/an/an/an/an/an/a
Universitat de Barcelona
Curated by ChEMBL
Assay Description
Inhibition of wild type Influenza A virus (A/udorn/1972(H3N2)) M2 channel expressed in Xenopus oocyte plasma membranes after 2 mins by two-electrode ...
Eur J Med Chem 96: 318-29 (2015)
Article DOI: 10.1016/j.ejmech.2015.04.030
BindingDB Entry DOI: 10.7270/Q2B27X1P