null
SMILES: CSCC[C@H](NC(=O)c1ccc(CN(CC2CCCCC2)c2cccnc2)cc1-c1ccccc1C)C(O)=O
InChI Key: InChIKey=QQALNYVYQQBUSO-PMERELPUSA-N
Activity Spreadsheet -- Enzyme Inhibition Constant Data from BindingDB
Found 1 hit for monomerid = 50080765
Trg + Lig
Ki
nM
ΔG°
kcal/mole
IC50
nM
Kd
nM
EC50/IC50
nM
koff
s-1
kon
M-1s-1
pHTemp
°C
Protein farnesyltransferase subunit beta/geranylgeranyltransferase type-1 subunit alpha
(Bos taurus (bovine))
BDBM50080765
((S)-2-({5-[(Cyclohexylmethyl-pyridin-3-yl-amino)-m...)
Show SMILES CSCC[C@H](NC(=O)c1ccc(CN(CC2CCCCC2)c2cccnc2)cc1-c1ccccc1C)C(O)=O
Show InChI InChI=1S/C32H39N3O3S/c1-23-9-6-7-13-27(23)29-19-25(14-15-28(29)31(36)34-30(32(37)38)16-18-39-2)22-35(26-12-8-17-33-20-26)21-24-10-4-3-5-11-24/h6-9,12-15,17,19-20,24,30H,3-5,10-11,16,18,21-22H2,1-2H3,(H,34,36)(H,37,38)/t30-/m0/s1
n/an/a 0.100n/an/an/an/an/an/a
Abbott Laboratories
Curated by ChEMBL
Assay Description
In vitro inhibition of farnesyltransferase purified from bovine brain using scintillation proximity assay
J Med Chem 42: 3701-10 (1999)
Article DOI: 10.1021/jm9901935
BindingDB Entry DOI: 10.7270/Q2W958DC