BDBM50080847 3,6-Bis(3-piperidinopropionamido)acridine::3-Piperidin-1-yl-N-[6-(3-piperidin-1-yl-propionylamino)-acridin-3-yl]-propionamide::CHEMBL81268::N,N'-(acridine-3,6-diyl)bis(3-(piperidin-1-yl)propanamide)
SMILES: O=C(CCN1CCCCC1)Nc1ccc2cc3ccc(NC(=O)CCN4CCCCC4)cc3nc2c1
InChI Key: InChIKey=LOWHFCSBBFGECH-UHFFFAOYSA-N
Data: 4 IC50
Activity Spreadsheet -- Enzyme Inhibition Constant Data from BindingDB
Found 4 hits for monomerid = 50080847
Trg + Lig
Ki
nM
ΔG°
kcal/mole
IC50
nM
Kd
nM
EC50/IC50
nM
koff
s-1
kon
M-1s-1
pHTemp
°C
Telomerase reverse transcriptase
(Homo sapiens (Human))
BDBM50080847
(3,6-Bis(3-piperidinopropionamido)acridine | 3-Pipe...)
Show SMILES O=C(CCN1CCCCC1)Nc1ccc2cc3ccc(NC(=O)CCN4CCCCC4)cc3nc2c1
Show InChI InChI=1S/C29H37N5O2/c35-28(11-17-33-13-3-1-4-14-33)30-24-9-7-22-19-23-8-10-25(21-27(23)32-26(22)20-24)31-29(36)12-18-34-15-5-2-6-16-34/h7-10,19-21H,1-6,11-18H2,(H,30,35)(H,31,36)
NCI pathway
Reactome pathway
n/an/a 2.80E+3n/an/an/an/an/an/a
Institute of Cancer Research
Curated by ChEMBL
Assay Description
Ability to inhibit human telomerase in a modified cell-free TRAP assay using extracts from A2780 cell line
Bioorg Med Chem Lett 9: 2463-8 (1999)
BindingDB Entry DOI: 10.7270/Q2H41QN7
Telomerase reverse transcriptase
(Homo sapiens (Human))
BDBM50080847
(3,6-Bis(3-piperidinopropionamido)acridine | 3-Pipe...)
Show SMILES O=C(CCN1CCCCC1)Nc1ccc2cc3ccc(NC(=O)CCN4CCCCC4)cc3nc2c1
Show InChI InChI=1S/C29H37N5O2/c35-28(11-17-33-13-3-1-4-14-33)30-24-9-7-22-19-23-8-10-25(21-27(23)32-26(22)20-24)31-29(36)12-18-34-15-5-2-6-16-34/h7-10,19-21H,1-6,11-18H2,(H,30,35)(H,31,36)
NCI pathway
Reactome pathway
n/an/a 2.82E+9n/an/an/an/an/an/a
TBA
Assay Description
Inhibition of telomerase in Homo sapiens (human) A549 cells after 24 hr by TRAP assay
Citation and Details
Article DOI: 10.1007/s00044-011-9594-4
BindingDB Entry DOI: 10.7270/Q2X63QV3
Telomerase reverse transcriptase
(Homo sapiens (Human))
BDBM50080847
(3,6-Bis(3-piperidinopropionamido)acridine | 3-Pipe...)
Show SMILES O=C(CCN1CCCCC1)Nc1ccc2cc3ccc(NC(=O)CCN4CCCCC4)cc3nc2c1
Show InChI InChI=1S/C29H37N5O2/c35-28(11-17-33-13-3-1-4-14-33)30-24-9-7-22-19-23-8-10-25(21-27(23)32-26(22)20-24)31-29(36)12-18-34-15-5-2-6-16-34/h7-10,19-21H,1-6,11-18H2,(H,30,35)(H,31,36)
NCI pathway
Reactome pathway
n/an/a 2.80E+3n/an/an/an/an/an/a
Institute of Cancer Research
Curated by ChEMBL
Assay Description
Inhibitory activity against Telomerase evaluated by TRAP Assay studies.
J Med Chem 42: 4538-46 (1999)
BindingDB Entry DOI: 10.7270/Q2J103VC
Telomerase reverse transcriptase
(Homo sapiens (Human))
BDBM50080847
(3,6-Bis(3-piperidinopropionamido)acridine | 3-Pipe...)
Show SMILES O=C(CCN1CCCCC1)Nc1ccc2cc3ccc(NC(=O)CCN4CCCCC4)cc3nc2c1
Show InChI InChI=1S/C29H37N5O2/c35-28(11-17-33-13-3-1-4-14-33)30-24-9-7-22-19-23-8-10-25(21-27(23)32-26(22)20-24)31-29(36)12-18-34-15-5-2-6-16-34/h7-10,19-21H,1-6,11-18H2,(H,30,35)(H,31,36)
NCI pathway
Reactome pathway
n/an/a 2.80E+3n/an/an/an/an/an/a
Central University of Las Villas
Curated by ChEMBL
Assay Description
Inhibition of telomerase in human A2780 cells by TRAP assay
Eur J Med Chem 44: 4826-40 (2009)
Article DOI: 10.1016/j.ejmech.2009.07.029
BindingDB Entry DOI: 10.7270/Q20R9PHM