BDBM50080908 2-[(S)-2-Benzyl-3,6-dioxo-4-(3-phenyl-propyl)-piperazin-1-yl]-N-[(S)-1-(1-carbamimidoyl-piperidin-3-ylmethyl)-2-oxo-2-thiazol-2-yl-ethyl]-acetamide::CHEMBL256394::CHEMBL408552
SMILES: [H][C@@]1(C[C@H](NC(=O)CN2[C@@H](Cc3ccccc3)C(=O)N(CCCc3ccccc3)CC2=O)C(=O)c2nccs2)CCCN(C1)C(N)=N
InChI Key: InChIKey=VLENRKZVWUVYFG-UWDVWBIHSA-N
Data: 1 KI  1 IC50
Activity Spreadsheet -- Enzyme Inhibition Constant Data from BindingDB
Found 2 hits for monomerid = 50080908
Trg + Lig
Ki
nM
ΔG°
kcal/mole
IC50
nM
Kd
nM
EC50/IC50
nM
koff
s-1
kon
M-1s-1
pHTemp
°C
Prothrombin
(Homo sapiens (Human))
BDBM50080908
(2-[(S)-2-Benzyl-3,6-dioxo-4-(3-phenyl-propyl)-pipe...)
Show SMILES [H][C@@]1(C[C@H](NC(=O)CN2[C@@H](Cc3ccccc3)C(=O)N(CCCc3ccccc3)CC2=O)C(=O)c2nccs2)CCCN(C1)C(N)=N
Show InChI InChI=1S/C34H41N7O4S/c35-34(36)40-17-8-14-26(21-40)19-27(31(44)32-37-15-18-46-32)38-29(42)22-41-28(20-25-11-5-2-6-12-25)33(45)39(23-30(41)43)16-7-13-24-9-3-1-4-10-24/h1-6,9-12,15,18,26-28H,7-8,13-14,16-17,19-23H2,(H3,35,36)(H,38,42)/t26?,27-,28-/m0/s1
24n/an/an/an/an/an/an/an/a
Warner-Lambert Company
Curated by ChEMBL
Assay Description
Binding affinity against thrombin
Bioorg Med Chem Lett 9: 2497-502 (1999)
BindingDB Entry DOI: 10.7270/Q23T9GDD
Prothrombin
(Homo sapiens (Human))
BDBM50080908
(2-[(S)-2-Benzyl-3,6-dioxo-4-(3-phenyl-propyl)-pipe...)
Show SMILES [H][C@@]1(C[C@H](NC(=O)CN2[C@@H](Cc3ccccc3)C(=O)N(CCCc3ccccc3)CC2=O)C(=O)c2nccs2)CCCN(C1)C(N)=N
Show InChI InChI=1S/C34H41N7O4S/c35-34(36)40-17-8-14-26(21-40)19-27(31(44)32-37-15-18-46-32)38-29(42)22-41-28(20-25-11-5-2-6-12-25)33(45)39(23-30(41)43)16-7-13-24-9-3-1-4-10-24/h1-6,9-12,15,18,26-28H,7-8,13-14,16-17,19-23H2,(H3,35,36)(H,38,42)/t26?,27-,28-/m0/s1
n/an/a 240n/an/an/an/an/an/a
Warner-Lambert Company
Curated by ChEMBL
Assay Description
Binding affinity against thrombin
Bioorg Med Chem Lett 9: 2497-502 (1999)
BindingDB Entry DOI: 10.7270/Q23T9GDD