BDBM50081081 6-{4-[2-(4-Quinolin-8-yl-piperazin-1-yl)-ethyl]-phenyl}-pyridin-2-ylamine::CHEMBL87187
SMILES: Nc1cccc(n1)-c1ccc(CCN2CCN(CC2)c2cccc3cccnc23)cc1
InChI Key: InChIKey=BTEINZDTJWUOFJ-UHFFFAOYSA-N
Data: 3 KI  3 IC50
Activity Spreadsheet -- Enzyme Inhibition Constant Data from BindingDB
Found 6 hits for monomerid = 50081081
Trg + Lig
Ki
nM
ΔG°
kcal/mole
IC50
nM
Kd
nM
EC50/IC50
nM
koff
s-1
kon
M-1s-1
pHTemp
°C
5-hydroxytryptamine receptor 1A
(Homo sapiens (Human))
BDBM50081081
(6-{4-[2-(4-Quinolin-8-yl-piperazin-1-yl)-ethyl]-ph...)
Show SMILES Nc1cccc(n1)-c1ccc(CCN2CCN(CC2)c2cccc3cccnc23)cc1
Show InChI InChI=1S/C26H27N5/c27-25-8-2-6-23(29-25)21-11-9-20(10-12-21)13-15-30-16-18-31(19-17-30)24-7-1-4-22-5-3-14-28-26(22)24/h1-12,14H,13,15-19H2,(H2,27,29)
3n/an/an/an/an/an/an/an/a
Pfizer Inc. Groton
Curated by ChEMBL
Assay Description
Binding affinity of compound to human 5-hydroxytryptamine 1A receptor
Bioorg Med Chem Lett 9: 2569-72 (1999)
BindingDB Entry DOI: 10.7270/Q2BC3XRP
D(2) dopamine receptor
(Homo sapiens (Human))
BDBM50081081
(6-{4-[2-(4-Quinolin-8-yl-piperazin-1-yl)-ethyl]-ph...)
Show SMILES Nc1cccc(n1)-c1ccc(CCN2CCN(CC2)c2cccc3cccnc23)cc1
Show InChI InChI=1S/C26H27N5/c27-25-8-2-6-23(29-25)21-11-9-20(10-12-21)13-15-30-16-18-31(19-17-30)24-7-1-4-22-5-3-14-28-26(22)24/h1-12,14H,13,15-19H2,(H2,27,29)
Reactome pathway
11n/an/an/an/an/an/an/an/a
Pfizer Inc. Groton
Curated by ChEMBL
Assay Description
Binding ability of compound to human Dopamine receptor D2
Bioorg Med Chem Lett 9: 2569-72 (1999)
BindingDB Entry DOI: 10.7270/Q2BC3XRP
5-hydroxytryptamine receptor 2A
(Homo sapiens (Human))
BDBM50081081
(6-{4-[2-(4-Quinolin-8-yl-piperazin-1-yl)-ethyl]-ph...)
Show SMILES Nc1cccc(n1)-c1ccc(CCN2CCN(CC2)c2cccc3cccnc23)cc1
Show InChI InChI=1S/C26H27N5/c27-25-8-2-6-23(29-25)21-11-9-20(10-12-21)13-15-30-16-18-31(19-17-30)24-7-1-4-22-5-3-14-28-26(22)24/h1-12,14H,13,15-19H2,(H2,27,29)
Reactome pathway
14n/an/an/an/an/an/an/an/a
Pfizer Inc. Groton
Curated by ChEMBL
Assay Description
Binding affinity of compound to human 5-hydroxytryptamine 2A receptor
Bioorg Med Chem Lett 9: 2569-72 (1999)
BindingDB Entry DOI: 10.7270/Q2BC3XRP
Nitric oxide synthase, brain
(Homo sapiens (Human))
BDBM50081081
(6-{4-[2-(4-Quinolin-8-yl-piperazin-1-yl)-ethyl]-ph...)
Show SMILES Nc1cccc(n1)-c1ccc(CCN2CCN(CC2)c2cccc3cccnc23)cc1
Show InChI InChI=1S/C26H27N5/c27-25-8-2-6-23(29-25)21-11-9-20(10-12-21)13-15-30-16-18-31(19-17-30)24-7-1-4-22-5-3-14-28-26(22)24/h1-12,14H,13,15-19H2,(H2,27,29)
Reactome pathway
n/an/a 212n/an/an/an/an/an/a
Pfizer Inc. Groton
Curated by ChEMBL
Assay Description
Inhibitory activity against human neuronal nitric oxide synthase (nNOS)
Bioorg Med Chem Lett 9: 2569-72 (1999)
BindingDB Entry DOI: 10.7270/Q2BC3XRP
Nitric-oxide synthase, brain
(Rattus norvegicus (rat))
BDBM50081081
(6-{4-[2-(4-Quinolin-8-yl-piperazin-1-yl)-ethyl]-ph...)
Show SMILES Nc1cccc(n1)-c1ccc(CCN2CCN(CC2)c2cccc3cccnc23)cc1
Show InChI InChI=1S/C26H27N5/c27-25-8-2-6-23(29-25)21-11-9-20(10-12-21)13-15-30-16-18-31(19-17-30)24-7-1-4-22-5-3-14-28-26(22)24/h1-12,14H,13,15-19H2,(H2,27,29)
n/an/a 130n/an/an/an/an/an/a
Pfizer Inc. Groton
Curated by ChEMBL
Assay Description
Inhibitory activity against rat neuronal nitric oxide synthase (nNOS)
Bioorg Med Chem Lett 9: 2569-72 (1999)
BindingDB Entry DOI: 10.7270/Q2BC3XRP
Nitric oxide synthase, endothelial
(Homo sapiens (Human))
BDBM50081081
(6-{4-[2-(4-Quinolin-8-yl-piperazin-1-yl)-ethyl]-ph...)
Show SMILES Nc1cccc(n1)-c1ccc(CCN2CCN(CC2)c2cccc3cccnc23)cc1
Show InChI InChI=1S/C26H27N5/c27-25-8-2-6-23(29-25)21-11-9-20(10-12-21)13-15-30-16-18-31(19-17-30)24-7-1-4-22-5-3-14-28-26(22)24/h1-12,14H,13,15-19H2,(H2,27,29)
n/an/a 825n/an/an/an/an/an/a
Pfizer Inc. Groton
Curated by ChEMBL
Assay Description
Inhibitory activity against human endothelial nitric oxide synthase (eNOS)
Bioorg Med Chem Lett 9: 2569-72 (1999)
BindingDB Entry DOI: 10.7270/Q2BC3XRP