BDBM50081159 CHEMBL3421940
SMILES: [#8]-c1ccc(\[#6]=[#6]-2\[#6](=O)-[#7](-[#6]-c3ccccc3)-[#6](=O)-[#7](-[#6]-c3ccccc3)-[#6]-2=O)cc1
InChI Key: InChIKey=UKSHIYSCOTVTNF-UHFFFAOYSA-N
Data: 1 IC50
Activity Spreadsheet -- Enzyme Inhibition Constant Data from BindingDB
Found 1 hit for monomerid = 50081159
Trg + Lig
Ki
nM
ΔG°
kcal/mole
IC50
nM
Kd
nM
EC50/IC50
nM
koff
s-1
kon
M-1s-1
pHTemp
°C
Histone acetyltransferase p300
(Homo sapiens (Human))
BDBM50081159
(CHEMBL3421940)
Show SMILES [#8]-c1ccc(\[#6]=[#6]-2\[#6](=O)-[#7](-[#6]-c3ccccc3)-[#6](=O)-[#7](-[#6]-c3ccccc3)-[#6]-2=O)cc1
Show InChI InChI=1S/C25H20N2O4/c28-21-13-11-18(12-14-21)15-22-23(29)26(16-19-7-3-1-4-8-19)25(31)27(24(22)30)17-20-9-5-2-6-10-20/h1-15,28H,16-17H2
n/an/a 2.10E+3n/an/an/an/an/an/a
Universit£ degli Studi di Salerno
Curated by ChEMBL
Assay Description
Inhibition of P300 (unknown origin) using histone H3/[acetyl-3H]-acetyl coenzyme A as substrate
J Med Chem 58: 2779-98 (2015)
Article DOI: 10.1021/jm5019687
BindingDB Entry DOI: 10.7270/Q2736SMP