BDBM50081178 CHEMBL3421971
SMILES: COc1cc(ccc1Nc1nccc(n1)-c1cn(C)c2c(C)nccc12)N1CCN(C)CC1
InChI Key: InChIKey=DSAZIMVNBOYSQB-UHFFFAOYSA-N
Data: 4 IC50
Activity Spreadsheet -- Enzyme Inhibition Constant Data from BindingDB
Found 4 hits for monomerid = 50081178
Trg + Lig
Ki
nM
ΔG°
kcal/mole
IC50
nM
Kd
nM
EC50/IC50
nM
koff
s-1
kon
M-1s-1
pHTemp
°C
Dual-specificity tyrosine-regulated kinases 1B
(Homo sapiens (Human))
BDBM50081178
(CHEMBL3421971)
Show SMILES COc1cc(ccc1Nc1nccc(n1)-c1cn(C)c2c(C)nccc12)N1CCN(C)CC1
Show InChI InChI=1S/C25H29N7O/c1-17-24-19(7-9-26-17)20(16-31(24)3)21-8-10-27-25(28-21)29-22-6-5-18(15-23(22)33-4)32-13-11-30(2)12-14-32/h5-10,15-16H,11-14H2,1-4H3,(H,27,28,29)
n/an/a 9n/an/an/an/an/an/a
AstraZeneca
Curated by ChEMBL
Assay Description
Inhibition of recombinant Dyrk1B (unknown origin) using FITC-Asp-His-Thr-Gly-Phe-Leu-Thr-Glu-Tyr-Val-Ala-Thr-Arg-NH2 as substrate after 60 mins
J Med Chem 58: 2834-44 (2015)
Article DOI: 10.1021/acs.jmedchem.5b00098
BindingDB Entry DOI: 10.7270/Q23B61VW
Cyclin-dependent kinase 2
(Homo sapiens (Human))
BDBM50081178
(CHEMBL3421971)
Show SMILES COc1cc(ccc1Nc1nccc(n1)-c1cn(C)c2c(C)nccc12)N1CCN(C)CC1
Show InChI InChI=1S/C25H29N7O/c1-17-24-19(7-9-26-17)20(16-31(24)3)21-8-10-27-25(28-21)29-22-6-5-18(15-23(22)33-4)32-13-11-30(2)12-14-32/h5-10,15-16H,11-14H2,1-4H3,(H,27,28,29)
NCI pathway
Reactome pathway
n/an/a 1.37E+4n/an/an/an/an/an/a
AstraZeneca
Curated by ChEMBL
Assay Description
Inhibition of human recombinant full length C-terminal His6-tagged CDK2 expressed in baculovirus infected Sf21 insect cells using fluorescence substr...
J Med Chem 58: 2834-44 (2015)
Article DOI: 10.1021/acs.jmedchem.5b00098
BindingDB Entry DOI: 10.7270/Q23B61VW
Dual-specificity tyrosine-regulated kinases 1B
(Homo sapiens (Human))
BDBM50081178
(CHEMBL3421971)
Show SMILES COc1cc(ccc1Nc1nccc(n1)-c1cn(C)c2c(C)nccc12)N1CCN(C)CC1
Show InChI InChI=1S/C25H29N7O/c1-17-24-19(7-9-26-17)20(16-31(24)3)21-8-10-27-25(28-21)29-22-6-5-18(15-23(22)33-4)32-13-11-30(2)12-14-32/h5-10,15-16H,11-14H2,1-4H3,(H,27,28,29)
n/an/a 168n/an/an/an/an/an/a
AstraZeneca
Curated by ChEMBL
Assay Description
Inhibition of human full length C-terminal c-Myc tagged Dyrk1B phosphorylation overexpressed in monkey COS1 cells after 5 hrs by ELISA
J Med Chem 58: 2834-44 (2015)
Article DOI: 10.1021/acs.jmedchem.5b00098
BindingDB Entry DOI: 10.7270/Q23B61VW
Insulin-like growth factor I receptor
(Homo sapiens (Human))
BDBM50081178
(CHEMBL3421971)
Show SMILES COc1cc(ccc1Nc1nccc(n1)-c1cn(C)c2c(C)nccc12)N1CCN(C)CC1
Show InChI InChI=1S/C25H29N7O/c1-17-24-19(7-9-26-17)20(16-31(24)3)21-8-10-27-25(28-21)29-22-6-5-18(15-23(22)33-4)32-13-11-30(2)12-14-32/h5-10,15-16H,11-14H2,1-4H3,(H,27,28,29)
Reactome pathway
n/an/a 3.17E+3n/an/an/an/an/an/a
AstraZeneca
Curated by ChEMBL
Assay Description
Inhibition of human recombinant N-terminal His6-tagged IGF-1R using fluorescence substrate after 80 mins by caliper off-chip incubation mobility shif...
J Med Chem 58: 2834-44 (2015)
Article DOI: 10.1021/acs.jmedchem.5b00098
BindingDB Entry DOI: 10.7270/Q23B61VW