BDBM50081192 CHEMBL3421977
SMILES: Cc1nccc2c(c[nH]c12)-c1ccnc(n1)-c1ccc(cc1)S(C)(=O)=O
InChI Key: InChIKey=WDJPGJTYVFXRTA-UHFFFAOYSA-N
Data: 4 IC50
Activity Spreadsheet -- Enzyme Inhibition Constant Data from BindingDB
Found 4 hits for monomerid = 50081192
Trg + Lig
Ki
nM
ΔG°
kcal/mole
IC50
nM
Kd
nM
EC50/IC50
nM
koff
s-1
kon
M-1s-1
pHTemp
°C
Insulin-like growth factor I receptor
(Homo sapiens (Human))
BDBM50081192
(CHEMBL3421977)
Show SMILES Cc1nccc2c(c[nH]c12)-c1ccnc(n1)-c1ccc(cc1)S(C)(=O)=O
Show InChI InChI=1S/C19H16N4O2S/c1-12-18-15(7-9-20-12)16(11-22-18)17-8-10-21-19(23-17)13-3-5-14(6-4-13)26(2,24)25/h3-11,22H,1-2H3
Reactome pathway
n/an/a>2.90E+4n/an/an/an/an/an/a
AstraZeneca
Curated by ChEMBL
Assay Description
Inhibition of human recombinant N-terminal His6-tagged IGF-1R using fluorescence substrate after 80 mins by caliper off-chip incubation mobility shif...
J Med Chem 58: 2834-44 (2015)
Article DOI: 10.1021/acs.jmedchem.5b00098
BindingDB Entry DOI: 10.7270/Q23B61VW
Cyclin-dependent kinase 2
(Homo sapiens (Human))
BDBM50081192
(CHEMBL3421977)
Show SMILES Cc1nccc2c(c[nH]c12)-c1ccnc(n1)-c1ccc(cc1)S(C)(=O)=O
Show InChI InChI=1S/C19H16N4O2S/c1-12-18-15(7-9-20-12)16(11-22-18)17-8-10-21-19(23-17)13-3-5-14(6-4-13)26(2,24)25/h3-11,22H,1-2H3
NCI pathway
Reactome pathway
n/an/a>1.00E+5n/an/an/an/an/an/a
AstraZeneca
Curated by ChEMBL
Assay Description
Inhibition of human recombinant full length C-terminal His6-tagged CDK2 expressed in baculovirus infected Sf21 insect cells using fluorescence substr...
J Med Chem 58: 2834-44 (2015)
Article DOI: 10.1021/acs.jmedchem.5b00098
BindingDB Entry DOI: 10.7270/Q23B61VW
Dual-specificity tyrosine-regulated kinases 1B
(Homo sapiens (Human))
BDBM50081192
(CHEMBL3421977)
Show SMILES Cc1nccc2c(c[nH]c12)-c1ccnc(n1)-c1ccc(cc1)S(C)(=O)=O
Show InChI InChI=1S/C19H16N4O2S/c1-12-18-15(7-9-20-12)16(11-22-18)17-8-10-21-19(23-17)13-3-5-14(6-4-13)26(2,24)25/h3-11,22H,1-2H3
n/an/a 14n/an/an/an/an/an/a
AstraZeneca
Curated by ChEMBL
Assay Description
Inhibition of recombinant Dyrk1B (unknown origin) using FITC-Asp-His-Thr-Gly-Phe-Leu-Thr-Glu-Tyr-Val-Ala-Thr-Arg-NH2 as substrate after 60 mins
J Med Chem 58: 2834-44 (2015)
Article DOI: 10.1021/acs.jmedchem.5b00098
BindingDB Entry DOI: 10.7270/Q23B61VW
Dual-specificity tyrosine-regulated kinases 1B
(Homo sapiens (Human))
BDBM50081192
(CHEMBL3421977)
Show SMILES Cc1nccc2c(c[nH]c12)-c1ccnc(n1)-c1ccc(cc1)S(C)(=O)=O
Show InChI InChI=1S/C19H16N4O2S/c1-12-18-15(7-9-20-12)16(11-22-18)17-8-10-21-19(23-17)13-3-5-14(6-4-13)26(2,24)25/h3-11,22H,1-2H3
n/an/a 2.12E+3n/an/an/an/an/an/a
AstraZeneca
Curated by ChEMBL
Assay Description
Inhibition of human full length C-terminal c-Myc tagged Dyrk1B phosphorylation overexpressed in monkey COS1 cells after 5 hrs by ELISA
J Med Chem 58: 2834-44 (2015)
Article DOI: 10.1021/acs.jmedchem.5b00098
BindingDB Entry DOI: 10.7270/Q23B61VW