BDBM50081399 CHEMBL3422016::US10065961, Compound 19::US10683295, Compound 19::US10941151, Compound 19::US9475814, 19
SMILES: C[C@H]1N(CCn2c1nnc2-c1nc(C)cs1)C(=O)c1ccc(cc1)-c1cccs1
InChI Key: InChIKey=WZHKQWSHHGMARO-CQSZACIVSA-N
Data: 5 KI  12 IC50
Activity Spreadsheet -- Enzyme Inhibition Constant Data from BindingDB
Found 17 hits for monomerid = 50081399
Trg + Lig
Ki
nM
ΔG°
kcal/mole
IC50
nM
Kd
nM
EC50/IC50
nM
koff
s-1
kon
M-1s-1
pHTemp
°C
Neurokinin 3 receptor
(Homo sapiens (Human))
BDBM50081399
(CHEMBL3422016 | US10065961, Compound 19 | US106832...)
Show SMILES C[C@H]1N(CCn2c1nnc2-c1nc(C)cs1)C(=O)c1ccc(cc1)-c1cccs1 |r|
Show InChI InChI=1S/C21H19N5OS2/c1-13-12-29-20(22-13)19-24-23-18-14(2)25(9-10-26(18)19)21(27)16-7-5-15(6-8-16)17-4-3-11-28-17/h3-8,11-12,14H,9-10H2,1-2H3/t14-/m1/s1
Reactome pathway
US Patent
6n/an/an/an/an/an/an/an/a
Ogeda SA
US Patent
Assay Description
NK3: The ability of compounds of the invention to inhibit the binding of the NK-3 receptor selective antagonist 3H-SB222200 was assessed by an in vit...
US Patent US10683295 (2020)
Neuromedin-K receptor
(Homo sapiens (Human))
BDBM50081399
(CHEMBL3422016 | US10065961, Compound 19 | US106832...)
Show SMILES C[C@H]1N(CCn2c1nnc2-c1nc(C)cs1)C(=O)c1ccc(cc1)-c1cccs1 |r|
Show InChI InChI=1S/C21H19N5OS2/c1-13-12-29-20(22-13)19-24-23-18-14(2)25(9-10-26(18)19)21(27)16-7-5-15(6-8-16)17-4-3-11-28-17/h3-8,11-12,14H,9-10H2,1-2H3/t14-/m1/s1
Reactome pathway
US Patent
6n/an/an/an/an/an/a7.4n/a
Euroscreen S.A.
US Patent
Assay Description
The ability of compounds of the invention to inhibit the binding of the NK-3 receptor selective antagonist 3H-SB222200 was assessed by an in vitro ra...
US Patent US9475814 (2016)
BindingDB Entry DOI: 10.7270/Q2B8571Q
Neurokinin 3 receptor
(Homo sapiens (Human))
BDBM50081399
(CHEMBL3422016 | US10065961, Compound 19 | US106832...)
Show SMILES C[C@H]1N(CCn2c1nnc2-c1nc(C)cs1)C(=O)c1ccc(cc1)-c1cccs1 |r|
Show InChI InChI=1S/C21H19N5OS2/c1-13-12-29-20(22-13)19-24-23-18-14(2)25(9-10-26(18)19)21(27)16-7-5-15(6-8-16)17-4-3-11-28-17/h3-8,11-12,14H,9-10H2,1-2H3/t14-/m1/s1
Reactome pathway
US Patent
6n/an/an/an/an/an/an/an/a
Ogeda SA
US Patent
Assay Description
NK3: The ability of compounds of the invention to inhibit the binding of the NK-3 receptor selective antagonist 3H-SB222200 was assessed by an in vit...
US Patent US10941151 (2021)
Neuromedin-K receptor
(Homo sapiens (Human))
BDBM50081399
(CHEMBL3422016 | US10065961, Compound 19 | US106832...)
Show SMILES C[C@H]1N(CCn2c1nnc2-c1nc(C)cs1)C(=O)c1ccc(cc1)-c1cccs1 |r|
Show InChI InChI=1S/C21H19N5OS2/c1-13-12-29-20(22-13)19-24-23-18-14(2)25(9-10-26(18)19)21(27)16-7-5-15(6-8-16)17-4-3-11-28-17/h3-8,11-12,14H,9-10H2,1-2H3/t14-/m1/s1
Reactome pathway
US Patent
6n/an/an/an/an/an/an/an/a
Ogeda SA.
US Patent
Assay Description
The antagonist activity of compounds of the invention is measured following pre-incubation (3 minutes) of the compound with the cells, followed by ad...
US Patent US10065961 (2018)
BindingDB Entry DOI: 10.7270/Q2MW2K4R
Neuromedin-K receptor
(Homo sapiens (Human))
BDBM50081399
(CHEMBL3422016 | US10065961, Compound 19 | US106832...)
Show SMILES C[C@H]1N(CCn2c1nnc2-c1nc(C)cs1)C(=O)c1ccc(cc1)-c1cccs1 |r|
Show InChI InChI=1S/C21H19N5OS2/c1-13-12-29-20(22-13)19-24-23-18-14(2)25(9-10-26(18)19)21(27)16-7-5-15(6-8-16)17-4-3-11-28-17/h3-8,11-12,14H,9-10H2,1-2H3/t14-/m1/s1
Reactome pathway
6.30n/an/an/an/an/an/an/an/a
Euroscreen SA
Curated by ChEMBL
Assay Description
Displacement of [3H]-SB222200 from recombinant human NK3R expressed in CHO cell membranes after 90 mins by scintillation counting analysis
J Med Chem 58: 3060-82 (2015)
Article DOI: 10.1021/jm5017413
BindingDB Entry DOI: 10.7270/Q2ZP47TC
Cytochrome P450 2C9
(Homo sapiens (Human))
BDBM50081399
(CHEMBL3422016 | US10065961, Compound 19 | US106832...)
Show SMILES C[C@H]1N(CCn2c1nnc2-c1nc(C)cs1)C(=O)c1ccc(cc1)-c1cccs1 |r|
Show InChI InChI=1S/C21H19N5OS2/c1-13-12-29-20(22-13)19-24-23-18-14(2)25(9-10-26(18)19)21(27)16-7-5-15(6-8-16)17-4-3-11-28-17/h3-8,11-12,14H,9-10H2,1-2H3/t14-/m1/s1
Reactome pathway
n/an/a 8.00E+3n/an/an/an/an/an/a
Euroscreen SA
Curated by ChEMBL
Assay Description
Inhibition of CYP2C9 (unknown origin) by luciferase reporter assay in presence of NADPH regeneration system
J Med Chem 58: 3060-82 (2015)
Article DOI: 10.1021/jm5017413
BindingDB Entry DOI: 10.7270/Q2ZP47TC
Cytochrome P450 1A
(Homo sapiens (Human))
BDBM50081399
(CHEMBL3422016 | US10065961, Compound 19 | US106832...)
Show SMILES C[C@H]1N(CCn2c1nnc2-c1nc(C)cs1)C(=O)c1ccc(cc1)-c1cccs1 |r|
Show InChI InChI=1S/C21H19N5OS2/c1-13-12-29-20(22-13)19-24-23-18-14(2)25(9-10-26(18)19)21(27)16-7-5-15(6-8-16)17-4-3-11-28-17/h3-8,11-12,14H,9-10H2,1-2H3/t14-/m1/s1
Reactome pathway
n/an/a 8.00E+3n/an/an/an/an/an/a
Euroscreen SA
Curated by ChEMBL
Assay Description
Inhibition of CYP1A2 (unknown origin) by luciferase reporter assay in presence of NADPH regeneration system
J Med Chem 58: 3060-82 (2015)
Article DOI: 10.1021/jm5017413
BindingDB Entry DOI: 10.7270/Q2ZP47TC
Potassium voltage-gated channel subfamily H member 2
(Homo sapiens (Human))
BDBM50081399
(CHEMBL3422016 | US10065961, Compound 19 | US106832...)
Show SMILES C[C@H]1N(CCn2c1nnc2-c1nc(C)cs1)C(=O)c1ccc(cc1)-c1cccs1 |r|
Show InChI InChI=1S/C21H19N5OS2/c1-13-12-29-20(22-13)19-24-23-18-14(2)25(9-10-26(18)19)21(27)16-7-5-15(6-8-16)17-4-3-11-28-17/h3-8,11-12,14H,9-10H2,1-2H3/t14-/m1/s1
Reactome pathway
n/an/a 1.70E+4n/an/an/an/an/an/a
Euroscreen SA
Curated by ChEMBL
Assay Description
Inhibition of human ERG expressed in HEK293 cells after 5 mins by patch-clamp assay
J Med Chem 58: 3060-82 (2015)
Article DOI: 10.1021/jm5017413
BindingDB Entry DOI: 10.7270/Q2ZP47TC
Transcriptional regulator ERG
(Homo sapiens (Human))
BDBM50081399
(CHEMBL3422016 | US10065961, Compound 19 | US106832...)
Show SMILES C[C@H]1N(CCn2c1nnc2-c1nc(C)cs1)C(=O)c1ccc(cc1)-c1cccs1 |r|
Show InChI InChI=1S/C21H19N5OS2/c1-13-12-29-20(22-13)19-24-23-18-14(2)25(9-10-26(18)19)21(27)16-7-5-15(6-8-16)17-4-3-11-28-17/h3-8,11-12,14H,9-10H2,1-2H3/t14-/m1/s1
US Patent
n/an/a 1.70E+4n/an/an/an/an/an/a
Ogeda SA.
US Patent
Assay Description
The human Ether-a-go-go Related Gene (hERG) encodes the inward rectifying voltage gated potassium channel in the heart (IKr) which is involved in car...
US Patent US10065961 (2018)
BindingDB Entry DOI: 10.7270/Q2MW2K4R
Neuromedin-K receptor
(Homo sapiens (Human))
BDBM50081399
(CHEMBL3422016 | US10065961, Compound 19 | US106832...)
Show SMILES C[C@H]1N(CCn2c1nnc2-c1nc(C)cs1)C(=O)c1ccc(cc1)-c1cccs1 |r|
Show InChI InChI=1S/C21H19N5OS2/c1-13-12-29-20(22-13)19-24-23-18-14(2)25(9-10-26(18)19)21(27)16-7-5-15(6-8-16)17-4-3-11-28-17/h3-8,11-12,14H,9-10H2,1-2H3/t14-/m1/s1
Reactome pathway
US Patent
n/an/a 8n/an/an/an/an/an/a
Ogeda SA.
US Patent
Assay Description
The antagonist activity of compounds of the invention is measured following pre-incubation (3 minutes) of the compound with the cells, followed by ad...
US Patent US10065961 (2018)
BindingDB Entry DOI: 10.7270/Q2MW2K4R
Melanin-concentrating hormone receptor 2/HERG
(Homo sapiens (Human))
BDBM50081399
(CHEMBL3422016 | US10065961, Compound 19 | US106832...)
Show SMILES C[C@H]1N(CCn2c1nnc2-c1nc(C)cs1)C(=O)c1ccc(cc1)-c1cccs1 |r|
Show InChI InChI=1S/C21H19N5OS2/c1-13-12-29-20(22-13)19-24-23-18-14(2)25(9-10-26(18)19)21(27)16-7-5-15(6-8-16)17-4-3-11-28-17/h3-8,11-12,14H,9-10H2,1-2H3/t14-/m1/s1
Reactome pathway
US Patent
n/an/a 1.70E+4n/an/an/an/an/an/a
Ogeda SA
US Patent
Assay Description
hERG: The hERG inhibition study aims at quantifying the in vitro effects of compounds of the invention on the potassium-selective IKr current generat...
US Patent US10683295 (2020)
Cytochrome P450 2D6
(Homo sapiens (Human))
BDBM50081399
(CHEMBL3422016 | US10065961, Compound 19 | US106832...)
Show SMILES C[C@H]1N(CCn2c1nnc2-c1nc(C)cs1)C(=O)c1ccc(cc1)-c1cccs1 |r|
Show InChI InChI=1S/C21H19N5OS2/c1-13-12-29-20(22-13)19-24-23-18-14(2)25(9-10-26(18)19)21(27)16-7-5-15(6-8-16)17-4-3-11-28-17/h3-8,11-12,14H,9-10H2,1-2H3/t14-/m1/s1
n/an/a 4.20E+4n/an/an/an/an/an/a
Euroscreen SA
Curated by ChEMBL
Assay Description
Inhibition of CYP2D6 (unknown origin) by luciferase reporter assay in presence of NADPH regeneration system
J Med Chem 58: 3060-82 (2015)
Article DOI: 10.1021/jm5017413
BindingDB Entry DOI: 10.7270/Q2ZP47TC
Cytochrome P450 3A4
(Homo sapiens (Human))
BDBM50081399
(CHEMBL3422016 | US10065961, Compound 19 | US106832...)
Show SMILES C[C@H]1N(CCn2c1nnc2-c1nc(C)cs1)C(=O)c1ccc(cc1)-c1cccs1 |r|
Show InChI InChI=1S/C21H19N5OS2/c1-13-12-29-20(22-13)19-24-23-18-14(2)25(9-10-26(18)19)21(27)16-7-5-15(6-8-16)17-4-3-11-28-17/h3-8,11-12,14H,9-10H2,1-2H3/t14-/m1/s1
Reactome pathway
n/an/a 1.10E+4n/an/an/an/an/an/a
Euroscreen SA
Curated by ChEMBL
Assay Description
Inhibition of CYP3A4 (unknown origin) by luciferase reporter assay in presence of NADPH regeneration system
J Med Chem 58: 3060-82 (2015)
Article DOI: 10.1021/jm5017413
BindingDB Entry DOI: 10.7270/Q2ZP47TC
Neuromedin-K receptor
(Homo sapiens (Human))
BDBM50081399
(CHEMBL3422016 | US10065961, Compound 19 | US106832...)
Show SMILES C[C@H]1N(CCn2c1nnc2-c1nc(C)cs1)C(=O)c1ccc(cc1)-c1cccs1 |r|
Show InChI InChI=1S/C21H19N5OS2/c1-13-12-29-20(22-13)19-24-23-18-14(2)25(9-10-26(18)19)21(27)16-7-5-15(6-8-16)17-4-3-11-28-17/h3-8,11-12,14H,9-10H2,1-2H3/t14-/m1/s1
Reactome pathway
n/an/a 7.90n/an/an/an/an/an/a
Euroscreen SA
Curated by ChEMBL
Assay Description
Antagonist activity at recombinant human NK3R expressed in CHO cells assessed as inhibition of NKB-induced Ca2+ signaling by aequorin Ca2+ biolumines...
J Med Chem 58: 3060-82 (2015)
Article DOI: 10.1021/jm5017413
BindingDB Entry DOI: 10.7270/Q2ZP47TC
Potassium voltage-gated channel subfamily H member 2
(Homo sapiens (Human))
BDBM50081399
(CHEMBL3422016 | US10065961, Compound 19 | US106832...)
Show SMILES C[C@H]1N(CCn2c1nnc2-c1nc(C)cs1)C(=O)c1ccc(cc1)-c1cccs1 |r|
Show InChI InChI=1S/C21H19N5OS2/c1-13-12-29-20(22-13)19-24-23-18-14(2)25(9-10-26(18)19)21(27)16-7-5-15(6-8-16)17-4-3-11-28-17/h3-8,11-12,14H,9-10H2,1-2H3/t14-/m1/s1
Reactome pathway
US Patent
n/an/a 1.70E+4n/an/an/an/an/an/a
Euroscreen S.A.
US Patent
Assay Description
The hERG inhibition study aims at quantifying the in vitro effects of compounds of the invention on the potassium-selective IKf current generated in ...
US Patent US9475814 (2016)
BindingDB Entry DOI: 10.7270/Q2B8571Q
Neuromedin-K receptor
(Homo sapiens (Human))
BDBM50081399
(CHEMBL3422016 | US10065961, Compound 19 | US106832...)
Show SMILES C[C@H]1N(CCn2c1nnc2-c1nc(C)cs1)C(=O)c1ccc(cc1)-c1cccs1 |r|
Show InChI InChI=1S/C21H19N5OS2/c1-13-12-29-20(22-13)19-24-23-18-14(2)25(9-10-26(18)19)21(27)16-7-5-15(6-8-16)17-4-3-11-28-17/h3-8,11-12,14H,9-10H2,1-2H3/t14-/m1/s1
Reactome pathway
US Patent
n/an/a 8n/an/an/an/an/an/a
Euroscreen S.A.
US Patent
Assay Description
Changes in intracellular calcium levels are a recognized indicator of G protein-coupled receptor activity. The efficacy of compounds of the invention...
US Patent US9475814 (2016)
BindingDB Entry DOI: 10.7270/Q2B8571Q
Cytochrome P450 2C19
(Homo sapiens (Human))
BDBM50081399
(CHEMBL3422016 | US10065961, Compound 19 | US106832...)
Show SMILES C[C@H]1N(CCn2c1nnc2-c1nc(C)cs1)C(=O)c1ccc(cc1)-c1cccs1 |r|
Show InChI InChI=1S/C21H19N5OS2/c1-13-12-29-20(22-13)19-24-23-18-14(2)25(9-10-26(18)19)21(27)16-7-5-15(6-8-16)17-4-3-11-28-17/h3-8,11-12,14H,9-10H2,1-2H3/t14-/m1/s1
Reactome pathway
n/an/a 1.80E+4n/an/an/an/an/an/a
Euroscreen SA
Curated by ChEMBL
Assay Description
Inhibition of CYP2C19 (unknown origin) by luciferase reporter assay in presence of NADPH regeneration system
J Med Chem 58: 3060-82 (2015)
Article DOI: 10.1021/jm5017413
BindingDB Entry DOI: 10.7270/Q2ZP47TC