BDBM50081538 CHEMBL3422103
SMILES: CC(C)(O)CNc1cc(NC2CCCCC2)nn2c(cnc12)-c1ccc(cc1)C(=O)NC1CC1
InChI Key: InChIKey=DUEKAYNFYBLGOY-UHFFFAOYSA-N
Data: 1 IC50
Activity Spreadsheet -- Enzyme Inhibition Constant Data from BindingDB
Found 1 hit for monomerid = 50081538
Trg + Lig
Ki
nM
ΔG°
kcal/mole
IC50
nM
Kd
nM
EC50/IC50
nM
koff
s-1
kon
M-1s-1
pHTemp
°C
Dual specificity protein kinase TTK
(Homo sapiens (Human))
BDBM50081538
(CHEMBL3422103)
Show SMILES CC(C)(O)CNc1cc(NC2CCCCC2)nn2c(cnc12)-c1ccc(cc1)C(=O)NC1CC1
Show InChI InChI=1S/C26H34N6O2/c1-26(2,34)16-28-21-14-23(29-19-6-4-3-5-7-19)31-32-22(15-27-24(21)32)17-8-10-18(11-9-17)25(33)30-20-12-13-20/h8-11,14-15,19-20,28,34H,3-7,12-13,16H2,1-2H3,(H,29,31)(H,30,33)
n/an/a 13n/an/an/an/an/an/a
EntreMed Inc.
Curated by ChEMBL
Assay Description
Inhibition of TTK (unknown origin) using p38 MAPK as substrate by fluorescence assay
J Med Chem 58: 3366-92 (2015)
Article DOI: 10.1021/jm501740a
BindingDB Entry DOI: 10.7270/Q2Q52RCN