BDBM50081553 CHEMBL3422066
SMILES: O=C(CC1(CCCCC1)N1CCOCC1)Nc1ccc2[nH]nc(-c3ccc(cc3)N3CCOCC3)c2c1
InChI Key: InChIKey=WRAAWGXBFIGQKT-UHFFFAOYSA-N
Data: 3 IC50
Activity Spreadsheet -- Enzyme Inhibition Constant Data from BindingDB
Found 3 hits for monomerid = 50081553
Trg + Lig
Ki
nM
ΔG°
kcal/mole
IC50
nM
Kd
nM
EC50/IC50
nM
koff
s-1
kon
M-1s-1
pHTemp
°C
Aurora kinase A
(Homo sapiens (Human))
BDBM50081553
(CHEMBL3422066)
Show SMILES O=C(CC1(CCCCC1)N1CCOCC1)Nc1ccc2[nH]nc(-c3ccc(cc3)N3CCOCC3)c2c1
Show InChI InChI=1S/C29H37N5O3/c35-27(21-29(10-2-1-3-11-29)34-14-18-37-19-15-34)30-23-6-9-26-25(20-23)28(32-31-26)22-4-7-24(8-5-22)33-12-16-36-17-13-33/h4-9,20H,1-3,10-19,21H2,(H,30,35)(H,31,32)
NCI pathway
Reactome pathway
n/an/a 2.10E+3n/an/an/an/an/an/a
EntreMed Inc.
Curated by ChEMBL
Assay Description
Inhibition of recombinant AURKA (unknown origin) preincubated for 15 mins prior to ATP addition by FRET-based homogenous assay
J Med Chem 58: 3366-92 (2015)
Article DOI: 10.1021/jm501740a
BindingDB Entry DOI: 10.7270/Q2Q52RCN
Dual specificity protein kinase TTK
(Homo sapiens (Human))
BDBM50081553
(CHEMBL3422066)
Show SMILES O=C(CC1(CCCCC1)N1CCOCC1)Nc1ccc2[nH]nc(-c3ccc(cc3)N3CCOCC3)c2c1
Show InChI InChI=1S/C29H37N5O3/c35-27(21-29(10-2-1-3-11-29)34-14-18-37-19-15-34)30-23-6-9-26-25(20-23)28(32-31-26)22-4-7-24(8-5-22)33-12-16-36-17-13-33/h4-9,20H,1-3,10-19,21H2,(H,30,35)(H,31,32)
n/an/a 12n/an/an/an/an/an/a
EntreMed Inc.
Curated by ChEMBL
Assay Description
Inhibition of amino terminal GST-fused full length human TTK using His6-SUMO-TTK-N as substrate preincubated for 15 mins prior to ATP addition by ind...
J Med Chem 58: 3366-92 (2015)
Article DOI: 10.1021/jm501740a
BindingDB Entry DOI: 10.7270/Q2Q52RCN
Vascular endothelial growth factor receptor 2
(Homo sapiens (Human))
BDBM50081553
(CHEMBL3422066)
Show SMILES O=C(CC1(CCCCC1)N1CCOCC1)Nc1ccc2[nH]nc(-c3ccc(cc3)N3CCOCC3)c2c1
Show InChI InChI=1S/C29H37N5O3/c35-27(21-29(10-2-1-3-11-29)34-14-18-37-19-15-34)30-23-6-9-26-25(20-23)28(32-31-26)22-4-7-24(8-5-22)33-12-16-36-17-13-33/h4-9,20H,1-3,10-19,21H2,(H,30,35)(H,31,32)
NCI pathway
Reactome pathway
n/an/a 1.20E+3n/an/an/an/an/an/a
EntreMed Inc.
Curated by ChEMBL
Assay Description
Inhibition of recombinant KDR (unknown origin) preincubated for 15 mins prior to ATP addition by FRET-based homogenous assay
J Med Chem 58: 3366-92 (2015)
Article DOI: 10.1021/jm501740a
BindingDB Entry DOI: 10.7270/Q2Q52RCN