BDBM50081556 CHEMBL3422069
SMILES: CN1CCC(CC1)Oc1ccc(cc1)-c1n[nH]c2ccc(cc12)C(=O)NC(C1CCCC1)c1ccsc1
InChI Key:
Data: 3 IC50
Activity Spreadsheet -- Enzyme Inhibition Constant Data from BindingDB
Found 3 hits for monomerid = 50081556
Trg + Lig
Ki
nM
ΔG°
kcal/mole
IC50
nM
Kd
nM
EC50/IC50
nM
koff
s-1
kon
M-1s-1
pHTemp
°C
Aurora kinase A
(Homo sapiens (Human))
BDBM50081556
(CHEMBL3422069)
Show SMILES CN1CCC(CC1)Oc1ccc(cc1)-c1n[nH]c2ccc(cc12)C(=O)NC(C1CCCC1)c1ccsc1
NCI pathway
Reactome pathway
n/an/a 2.00E+3n/an/an/an/an/an/a
EntreMed Inc.
Curated by ChEMBL
Assay Description
Inhibition of recombinant AURKA (unknown origin) preincubated for 15 mins prior to ATP addition by FRET-based homogenous assay
J Med Chem 58: 3366-92 (2015)
Article DOI: 10.1021/jm501740a
BindingDB Entry DOI: 10.7270/Q2Q52RCN
Dual specificity protein kinase TTK
(Homo sapiens (Human))
BDBM50081556
(CHEMBL3422069)
Show SMILES CN1CCC(CC1)Oc1ccc(cc1)-c1n[nH]c2ccc(cc12)C(=O)NC(C1CCCC1)c1ccsc1
n/an/a 2.70n/an/an/an/an/an/a
EntreMed Inc.
Curated by ChEMBL
Assay Description
Inhibition of amino terminal GST-fused full length human TTK using His6-SUMO-TTK-N as substrate preincubated for 15 mins prior to ATP addition by ind...
J Med Chem 58: 3366-92 (2015)
Article DOI: 10.1021/jm501740a
BindingDB Entry DOI: 10.7270/Q2Q52RCN
Vascular endothelial growth factor receptor 2
(Homo sapiens (Human))
BDBM50081556
(CHEMBL3422069)
Show SMILES CN1CCC(CC1)Oc1ccc(cc1)-c1n[nH]c2ccc(cc12)C(=O)NC(C1CCCC1)c1ccsc1
NCI pathway
Reactome pathway
n/an/a 2.90E+3n/an/an/an/an/an/a
EntreMed Inc.
Curated by ChEMBL
Assay Description
Inhibition of recombinant KDR (unknown origin) preincubated for 15 mins prior to ATP addition by FRET-based homogenous assay
J Med Chem 58: 3366-92 (2015)
Article DOI: 10.1021/jm501740a
BindingDB Entry DOI: 10.7270/Q2Q52RCN