BDBM50081610 CHEMBL3422088
SMILES: O=C(N[C@@H](C1CCCC1)c1ccccn1)c1ccc2[nH]nc(-c3ccc(cc3)N3C4CCCC3COC4)c2c1
InChI Key:
Data: 1 IC50
Activity Spreadsheet -- Enzyme Inhibition Constant Data from BindingDB
Found 1 hit for monomerid = 50081610
Trg + Lig
Ki
nM
ΔG°
kcal/mole
IC50
nM
Kd
nM
EC50/IC50
nM
koff
s-1
kon
M-1s-1
pHTemp
°C
Dual specificity protein kinase TTK
(Homo sapiens (Human))
BDBM50081610
(CHEMBL3422088)
Show SMILES O=C(N[C@@H](C1CCCC1)c1ccccn1)c1ccc2[nH]nc(-c3ccc(cc3)N3C4CCCC3COC4)c2c1 |r|
n/an/a 8.30n/an/an/an/an/an/a
EntreMed Inc.
Curated by ChEMBL
Assay Description
Inhibition of amino terminal GST-fused full length human TTK using His6-SUMO-TTK-N as substrate preincubated for 15 mins prior to ATP addition by ind...
J Med Chem 58: 3366-92 (2015)
Article DOI: 10.1021/jm501740a
BindingDB Entry DOI: 10.7270/Q2Q52RCN