null
SMILES: [#6]-[#6](-[#6])-[#6]-[#6@H](-[#7]-[#6](=O)-[#7]-1-[#6]-[#6]-[#6]-[#6]-[#6]-[#6]-1)-[#6](=O)-[#7]C([#6])([#6])[#6]-[#7](-[#6]\[#6]=[#6](/[#6])-[#6])-c1ccc(-[#8]-[#6]-c2ccccc2)cc1
InChI Key: InChIKey=FPNXXMXRCAXJCW-YTTGMZPUSA-N
Activity Spreadsheet -- Enzyme Inhibition Constant Data from BindingDB
Found 1 hit for monomerid = 50081687
Trg + Lig
Ki
nM
ΔG°
kcal/mole
IC50
nM
Kd
nM
EC50/IC50
nM
koff
s-1
kon
M-1s-1
pHTemp
°C
Voltage-dependent N-type calcium channel subunit alpha-1B
(Homo sapiens (Human))
BDBM50081687
(Azepane-1-carboxylic acid ((S)-1-{2-[(4-benzyloxy-...)
Show SMILES [#6]-[#6](-[#6])-[#6]-[#6@H](-[#7]-[#6](=O)-[#7]-1-[#6]-[#6]-[#6]-[#6]-[#6]-[#6]-1)-[#6](=O)-[#7]C([#6])([#6])[#6]-[#7](-[#6]\[#6]=[#6](/[#6])-[#6])-c1ccc(-[#8]-[#6]-c2ccccc2)cc1
Show InChI InChI=1S/C35H52N4O3/c1-27(2)20-23-39(30-16-18-31(19-17-30)42-25-29-14-10-9-11-15-29)26-35(5,6)37-33(40)32(24-28(3)4)36-34(41)38-21-12-7-8-13-22-38/h9-11,14-20,28,32H,7-8,12-13,21-26H2,1-6H3,(H,36,41)(H,37,40)/t32-/m0/s1
n/an/a 260n/an/an/an/an/an/a
Warner-Lambert Company
Curated by ChEMBL
Assay Description
Inhibition of N-type calcium channels in IMR32 human neuroblastoma cells
J Med Chem 42: 4239-49 (1999)
BindingDB Entry DOI: 10.7270/Q2QF8S22