BDBM50081715 CHEMBL3422336
SMILES: COc1ccc(OC)c2c3oc(cc(=O)c3cc(OC)c12)-c1ccccc1Cl
InChI Key: InChIKey=PMJMPNKCZAXICI-UHFFFAOYSA-N
Data: 3 IC50
Activity Spreadsheet -- Enzyme Inhibition Constant Data from BindingDB
Found 3 hits for monomerid = 50081715
Trg + Lig
Ki
nM
ΔG°
kcal/mole
IC50
nM
Kd
nM
EC50/IC50
nM
koff
s-1
kon
M-1s-1
pHTemp
°C
Cytochrome P450 1A
(Homo sapiens (Human))
BDBM50081715
(CHEMBL3422336)
Show SMILES COc1ccc(OC)c2c3oc(cc(=O)c3cc(OC)c12)-c1ccccc1Cl
Show InChI InChI=1S/C22H17ClO5/c1-25-16-8-9-17(26-2)21-20(16)19(27-3)10-13-15(24)11-18(28-22(13)21)12-6-4-5-7-14(12)23/h4-11H,1-3H3
Reactome pathway
n/an/a 58n/an/an/an/an/an/a
Shanghai Jiao Tong University
Curated by ChEMBL
Assay Description
Inhibition of human CYP1A2 assessed as reduction in 7-ethoxyresorufin O-deethylation activity by fluorescence based EROD assay
J Med Chem 58: 3534-47 (2015)
Article DOI: 10.1021/acs.jmedchem.5b00265
BindingDB Entry DOI: 10.7270/Q2XP76NJ
Cytochrome P450 1B1
(Homo sapiens (Human))
BDBM50081715
(CHEMBL3422336)
Show SMILES COc1ccc(OC)c2c3oc(cc(=O)c3cc(OC)c12)-c1ccccc1Cl
Show InChI InChI=1S/C22H17ClO5/c1-25-16-8-9-17(26-2)21-20(16)19(27-3)10-13-15(24)11-18(28-22(13)21)12-6-4-5-7-14(12)23/h4-11H,1-3H3
Reactome pathway
n/an/a 1.10n/an/an/an/an/an/a
Shanghai Jiao Tong University
Curated by ChEMBL
Assay Description
Inhibition of human CYP1B1 assessed as reduction in 7-ethoxyresorufin O-deethylation activity by fluorescence based EROD assay
J Med Chem 58: 3534-47 (2015)
Article DOI: 10.1021/acs.jmedchem.5b00265
BindingDB Entry DOI: 10.7270/Q2XP76NJ
Cytochrome P450 1A1
(Homo sapiens (Human))
BDBM50081715
(CHEMBL3422336)
Show SMILES COc1ccc(OC)c2c3oc(cc(=O)c3cc(OC)c12)-c1ccccc1Cl
Show InChI InChI=1S/C22H17ClO5/c1-25-16-8-9-17(26-2)21-20(16)19(27-3)10-13-15(24)11-18(28-22(13)21)12-6-4-5-7-14(12)23/h4-11H,1-3H3
Reactome pathway
n/an/a 19n/an/an/an/an/an/a
Shanghai Jiao Tong University
Curated by ChEMBL
Assay Description
Inhibition of human CYP1A1 assessed as reduction in 7-ethoxyresorufin O-deethylation activity by fluorescence based EROD assay
J Med Chem 58: 3534-47 (2015)
Article DOI: 10.1021/acs.jmedchem.5b00265
BindingDB Entry DOI: 10.7270/Q2XP76NJ