BDBM50081840 (S)-2-[(S)-2-Amino-3-(4-hydroxy-phenyl)-propionylamino]-3-(4-hydroxy-phenyl)-propionic acid::CHEMBL95286::Tyr-Tyr
SMILES: N[C@@H](Cc1ccc(O)cc1)C(=O)N[C@@H](Cc1ccc(O)cc1)C(O)=O
InChI Key: InChIKey=JAQGKXUEKGKTKX-HOTGVXAUSA-N
Data: 2 IC50  1 EC50
Activity Spreadsheet -- Enzyme Inhibition Constant Data from BindingDB
Found 3 hits for monomerid = 50081840
Trg + Lig
Ki
nM
ΔG°
kcal/mole
IC50
nM
Kd
nM
EC50/IC50
nM
koff
s-1
kon
M-1s-1
pHTemp
°C
Tyrosyl-tRNA synthetase
(Homo sapiens (Human))
BDBM50081840
((S)-2-[(S)-2-Amino-3-(4-hydroxy-phenyl)-propionyla...)
Show SMILES N[C@@H](Cc1ccc(O)cc1)C(=O)N[C@@H](Cc1ccc(O)cc1)C(O)=O
Show InChI InChI=1S/C18H20N2O5/c19-15(9-11-1-5-13(21)6-2-11)17(23)20-16(18(24)25)10-12-3-7-14(22)8-4-12/h1-8,15-16,21-22H,9-10,19H2,(H,20,23)(H,24,25)/t15-,16-/m0/s1
Reactome pathway
n/an/a 3.80E+3n/an/an/an/an/an/a
SmithKline Beecham Pharmaceuticals
Curated by ChEMBL
Assay Description
Compound was tested for inhibition of Staphylococcus aureus tyrosyl tRNA Synthetase
Bioorg Med Chem Lett 9: 2859-62 (1999)
BindingDB Entry DOI: 10.7270/Q2F18XX9
Oligopeptide transporter small intestine isoform
(Homo sapiens (Human))
BDBM50081840
((S)-2-[(S)-2-Amino-3-(4-hydroxy-phenyl)-propionyla...)
Show SMILES N[C@@H](Cc1ccc(O)cc1)C(=O)N[C@@H](Cc1ccc(O)cc1)C(O)=O
Show InChI InChI=1S/C18H20N2O5/c19-15(9-11-1-5-13(21)6-2-11)17(23)20-16(18(24)25)10-12-3-7-14(22)8-4-12/h1-8,15-16,21-22H,9-10,19H2,(H,20,23)(H,24,25)/t15-,16-/m0/s1
Reactome pathway
n/an/a 6.00E+4n/an/an/an/an/an/a
Pharmaceutical Research Institute
Curated by ChEMBL
Assay Description
Binding affinity to human PEPT1 assessed as inhibition of [14C]Gly-Sar uptake in MDCK cells
J Med Chem 49: 3636-44 (2006)
Article DOI: 10.1021/jm0511029
BindingDB Entry DOI: 10.7270/Q2P55P9R
Oligopeptide transporter small intestine isoform
(Homo sapiens (Human))
BDBM50081840
((S)-2-[(S)-2-Amino-3-(4-hydroxy-phenyl)-propionyla...)
Show SMILES N[C@@H](Cc1ccc(O)cc1)C(=O)N[C@@H](Cc1ccc(O)cc1)C(O)=O
Show InChI InChI=1S/C18H20N2O5/c19-15(9-11-1-5-13(21)6-2-11)17(23)20-16(18(24)25)10-12-3-7-14(22)8-4-12/h1-8,15-16,21-22H,9-10,19H2,(H,20,23)(H,24,25)/t15-,16-/m0/s1
Reactome pathway
n/an/an/an/a 6.00E+4n/an/an/an/a
Pharmaceutical Research Institute
Curated by ChEMBL
Assay Description
Activation of human PEPT1 expressed in MDCK cells
J Med Chem 49: 3636-44 (2006)
Article DOI: 10.1021/jm0511029
BindingDB Entry DOI: 10.7270/Q2P55P9R