BDBM50082131 CHEMBL3422655
SMILES: CC(=O)Nc1ccc(Oc2ccc3[nH]c(N)c(C#N)c3c2)cc1
InChI Key: InChIKey=IQMFACFLFXIYNW-UHFFFAOYSA-N
Data: 3 IC50
Activity Spreadsheet -- Enzyme Inhibition Constant Data from BindingDB
Found 3 hits for monomerid = 50082131
Trg + Lig
Ki
nM
ΔG°
kcal/mole
IC50
nM
Kd
nM
EC50/IC50
nM
koff
s-1
kon
M-1s-1
pHTemp
°C
6-phosphofructo-2-kinase/fructose-2,6-bisphosphatase 3 (PFKFB3)
(Homo sapiens (Human))
BDBM50082131
(CHEMBL3422655)
Show SMILES CC(=O)Nc1ccc(Oc2ccc3[nH]c(N)c(C#N)c3c2)cc1
Show InChI InChI=1S/C17H14N4O2/c1-10(22)20-11-2-4-12(5-3-11)23-13-6-7-16-14(8-13)15(9-18)17(19)21-16/h2-8,21H,19H2,1H3,(H,20,22)
n/an/a>1.00E+5n/an/an/an/an/an/a
AstraZeneca
Curated by ChEMBL
Assay Description
Inhibition of recombinant human PFKFB3 using fructose 6 phosphate as substrate assessed as ADP generation after 1 hr by ADP Glo assay
J Med Chem 58: 3611-25 (2015)
Article DOI: 10.1021/acs.jmedchem.5b00352
BindingDB Entry DOI: 10.7270/Q2571DQB
6-phosphofructo-2-kinase/fructose-2,6-bisphosphatase 2
(Homo sapiens (Human))
BDBM50082131
(CHEMBL3422655)
Show SMILES CC(=O)Nc1ccc(Oc2ccc3[nH]c(N)c(C#N)c3c2)cc1
Show InChI InChI=1S/C17H14N4O2/c1-10(22)20-11-2-4-12(5-3-11)23-13-6-7-16-14(8-13)15(9-18)17(19)21-16/h2-8,21H,19H2,1H3,(H,20,22)
n/an/a>1.00E+5n/an/an/an/an/an/a
AstraZeneca
Curated by ChEMBL
Assay Description
Inhibition of recombinant human PFKFB2 using fructose 6 phosphate as substrate assessed as ADP generation after 1 hr by ADP Glo assay
J Med Chem 58: 3611-25 (2015)
Article DOI: 10.1021/acs.jmedchem.5b00352
BindingDB Entry DOI: 10.7270/Q2571DQB
6-phosphofructo-2-kinase/fructose-2,6-bisphosphatase 1
(Homo sapiens (Human))
BDBM50082131
(CHEMBL3422655)
Show SMILES CC(=O)Nc1ccc(Oc2ccc3[nH]c(N)c(C#N)c3c2)cc1
Show InChI InChI=1S/C17H14N4O2/c1-10(22)20-11-2-4-12(5-3-11)23-13-6-7-16-14(8-13)15(9-18)17(19)21-16/h2-8,21H,19H2,1H3,(H,20,22)
n/an/a 2.40E+4n/an/an/an/an/an/a
AstraZeneca
Curated by ChEMBL
Assay Description
Inhibition of recombinant human PFKFB1 using fructose 6 phosphate as substrate assessed as ADP generation after 1 hr by ADP Glo assay
J Med Chem 58: 3611-25 (2015)
Article DOI: 10.1021/acs.jmedchem.5b00352
BindingDB Entry DOI: 10.7270/Q2571DQB